program: Orca
programVersion: 4.2.1
elementType: Cl Cl Cl S N N N N C C C C C C C C C C C C C C C C C H H H H H H H H H H H H H
charge: 0
multiplicity: 1
keywords: wb97x-d3
keywords: def2-TZVPP
keywords: def2/J RIJCOSX GRIDX6 NOFINALGRIDX
keywords: grid4 nofinalgrid
keywords: scfconv7
keywords: smallprint printgap noloewdin
keywords: NOSOSCF
formula: C17H13Cl3N4S
InChI: InChI=1S/C17H13Cl3N4S/c18-13-3-1-12(2-4-13)9-25-17(8-24-11-21-10-22-24)23-16-6-5-14(19)7-15(16)20/h1-7,10-11H,8-9H2
38 atoms
Cl 1.90804 -0.945028 3.584299
Cl -2.820309 0.022655 -4.214777
Cl 3.726882 -4.305102 -0.187513
S  -1.263595 2.091588 2.117101
N  0.976228 2.291439 -0.17116
N  -0.180309 -0.243678 1.565842
N  0.84291 1.488098 -1.230185
N  0.332037 3.599016 -1.779974
C  1.249909 1.735035 1.128058
C  -2.729468 1.099597 1.692384
C  0.012924 0.997637 1.602478
C  -2.798017 0.829691 0.219111
C  -2.835439 1.878328 -0.694618
C  -2.788173 -0.472667 -0.262314
C  0.789734 -1.146181 1.134134
C  -2.852547 1.638409 -2.056239
C  -2.81085 -0.730725 -1.625303
C  0.651759 3.547086 -0.514246
C  1.784731 -1.60813 1.993917
C  0.737952 -1.673175 -0.153664
C  -2.834005 0.32966 -2.514154
C  2.688964 -2.580801 1.597608
C  1.636685 -2.638418 -0.566138
C  2.605681 -3.092564 0.315291
C  0.463079 2.313615 -2.172188
H  1.502589 2.547078 1.811207
H  2.107255 1.066869 1.060423
H  -3.572793 1.701994 2.035211
H  -2.716754 0.1789 2.273224
H  -2.820573 2.902907 -0.344128
H  -2.74568 -1.301253 0.432573
H  -2.866108 2.462831 -2.755096
H  -2.79886 -1.748849 -1.989317
H  0.669063 4.372692 0.179857
H  -0.013242 -1.30044 -0.835414
H  3.44974 -2.92532 2.283219
H  1.587244 -3.030967 -1.571869
H  0.270911 1.977152 -3.178634
totalener: -2653.50953008 hartree
nucrepener: 2804.57720363 hartree
electener: -5458.08673371 hartree
oneelecener: -9224.86446239 hartree
twoeener: 3766.77772869 hartree
kineticenergy: 2647.24630731 hartree
xcener: -168.235588854442 hartree
chargesum: -0.0000000
charge: -0.070425 -0.080439 -0.075299 -0.080440 0.131446 -0.268331 -0.304988 -0.325832 -0.131047 -0.080810 0.150868 0.103795 -0.232770 -0.209140 0.210390 -0.099454 -0.134199 0.041696 -0.078141 -0.134153 0.086268 -0.097843 -0.131298 0.070726 0.066564 0.130602 0.141408 0.140812 0.117477 0.117810 0.125747 0.133474 0.131180 0.139938 0.126085 0.114831 0.121736 0.131758
qa: -0.0704 -0.0804 -0.0753 -0.0804 0.1314 -0.2683 -0.3050 -0.3258 -0.1310 -0.0808 0.1509 0.1038 -0.2328 -0.2091 0.2104 -0.0995 -0.1342 0.0417 -0.0781 -0.1342 0.0863 -0.0978 -0.1313 0.0707 0.0666 0.1306 0.1414 0.1408 0.1175 0.1178 0.1257 0.1335 0.1312 0.1399 0.1261 0.1148 0.1217 0.1318
va: 1.2534 1.2283 1.2283 2.3343 3.2892 3.0215 2.8425 3.0351 3.9954 3.8545 3.9054 3.5376 3.9976 3.9679 3.7465 3.8987 3.9337 4.0768 3.9958 3.9771 3.8946 4.0197 4.0557 3.9137 4.0446 1.0033 1.0089 0.9977 1.0346 1.0212 1.0128 1.0099 1.0073 1.0052 1.0139 1.0221 1.0127 1.0048
dispcorr: -0.026830411 hartree
energy: -2653.536360492026
dipole: -11.07658 10.77840 -0.29819 13.59589 -13.05282 0.54307 0.36445 0.58434 0.94879
magnitude: 1.13315 au
magnitude: 2.88025 debye
