program: Gaussian 09
title: 000030369
version: EM64L-G09RevD.01
frameworkgroup: C1[X(C15H22N2O2)]
method: RPBEPBE
basis: SDD
operation: Freq
keyword: #p
keyword: freq=noraman
keyword: PBEPBE/SDD
title: #p freq=noraman PBEPBE/SDD
converged: YES YES NO NO
title: Mulliken charges:
elementType: O O N N C C C C C C C C C C C C C C C H H H H H H H H H H H H H H H H H H H H H H
charge: -0.313286 -0.262280 -0.070620 -0.476939 -0.094510 -0.477077 -0.406896 -0.380178 -0.331875 -0.624991 0.253651 0.132357 0.339535 0.363489 -0.419830 -0.410274 -0.833248 -0.828105 -0.232750 0.259547 0.214390 0.233321 0.173667 0.241692 0.228520 0.179681 0.237958 0.223875 0.225818 0.184791 0.224950 0.325630 0.232252 0.232528 0.235611 0.224309 0.245125 0.222878 0.217711 0.284151 0.225421
chargesum: 0.00000
title: Mulliken charges with hydrogens summed into heavy atoms:
elementType: O O N N C C C C C C C C C C C C C C C
charge: -0.313286 -0.262280 -0.070620 -0.151309 0.165037 -0.029365 0.008463 0.028023 0.129958 0.010568 0.253651 0.132357 0.339535 0.363489 -0.187578 -0.177745 -0.128203 -0.103364 -0.007329
polarizability: 2.46873146e+02 3.02625710e+00 1.87029044e+02 3.71460633e+00 7.14105178e-01 1.17099665e+02
1716.lowfreq: -7.3429 -4.5869 -0.0007 -0.0005 0.0006 3.3132 10.4697 25.4692 39.1835
frequency: 8.7300 25.3431 39.1537 49.5267 68.7415 87.7044 96.0207 146.6732 154.9536 163.5439 170.4736 192.0967 202.2914 225.6878 237.2711 243.5895 288.6077 309.0544 311.1908 315.5194 333.4954 424.3746 430.7142 465.5180 514.2892 517.3334 537.1665 543.0085 547.1132 595.3428 619.7302 682.7966 695.1280 710.9439 751.8270 778.1457 785.6177 835.3340 848.0759 880.1213 897.5999 900.0617 908.5873 936.2439 968.0093 974.5173 986.9385 994.0870 1010.0516 1023.1431 1040.7458 1045.5673 1054.1305 1064.2308 1098.3967 1100.4760 1111.2128 1135.5001 1156.2039 1157.5950 1166.5369 1177.5738 1191.9836 1224.5645 1231.2268 1236.6921 1255.0243 1261.1921 1278.7625 1280.6349 1286.3900 1311.5153 1342.7964 1351.9260 1367.3401 1373.8597 1400.2101 1401.1610 1431.0658 1435.7489 1453.9662 1459.5961 1464.6586 1469.8845 1470.7898 1473.8735 1475.0767 1479.5700 1482.4151 1487.9182 1493.9795 1495.9127 1604.8905 1605.3330 1672.5917 2816.3369 2835.4513 2852.5117 2962.5628 2980.9517 2991.4571 3009.1424 3018.5814 3025.6798 3030.1758 3040.8804 3052.2560 3062.4429 3063.6066 3075.3632 3079.9819 3087.4889 3089.3948 3121.8455 3132.1394 3156.9296 3533.2002
redmass: 3.8713 3.2501 2.9091 4.1604 4.4319 4.3633 4.2393 3.0790 3.0354 1.0661 2.1835 1.3537 3.7387 2.8260 1.0693 3.0793 4.0289 2.3000 3.0697 3.5093 2.7013 4.1283 2.0579 3.0140 4.3701 3.0903 4.0756 3.4701 4.1421 1.4032 3.8006 5.2651 6.8347 5.2447 5.0612 1.2217 1.5599 4.8320 3.0919 2.4598 3.4632 1.3114 1.7097 2.9398 1.9128 1.3471 1.6597 2.4604 2.5183 2.3446 1.6753 1.6730 1.5797 2.0417 1.7116 1.5554 1.5396 2.3294 1.8921 2.9739 1.3091 1.1863 1.4202 1.7292 3.3019 1.6085 1.6016 1.6687 1.2235 2.5095 1.2578 1.3674 1.4618 1.4388 2.7183 2.4724 1.2561 1.2484 1.1695 1.9636 1.7895 1.1273 1.0549 1.1229 1.0762 1.1163 1.0912 1.1411 1.1923 1.3180 1.1242 1.6048 6.1833 6.2814 8.7293 1.0709 1.0682 1.0610 1.0419 1.0363 1.0578 1.0625 1.0716 1.0863 1.0878 1.0925 1.0924 1.1046 1.0970 1.1009 1.1013 1.0998 1.0982 1.0856 1.0919 1.0995 1.0755
irintensity: 0.2587 0.6225 0.6248 0.3710 1.5745 1.8951 1.0305 4.5061 0.4259 0.6741 5.8010 2.7384 1.3034 2.4225 1.1308 7.6268 4.2998 9.7880 3.0945 4.8212 0.9462 1.1275 10.0276 3.0999 0.2262 0.9661 5.2469 12.6708 0.7086 75.3011 10.4353 1.9796 12.3737 31.1243 11.5729 55.2682 5.1034 0.7666 9.8651 15.2889 5.5854 0.1227 3.1112 7.0337 2.3593 1.0520 75.8949 82.6982 174.2074 11.1688 5.9563 7.8495 12.7768 11.1762 2.1024 10.4257 14.8293 84.4255 69.9832 357.5503 2.0950 8.1246 0.4899 9.6257 28.2679 9.2566 8.0055 7.4758 2.3482 10.7739 6.1756 0.0568 3.0915 14.9827 40.7808 0.5021 25.4223 7.7818 0.8601 38.0998 43.5865 30.7382 33.7408 43.8062 14.6066 20.3746 14.9436 75.4486 43.6093 27.8891 20.8693 212.2847 8.0250 5.3186 218.5713 91.9080 50.3543 224.1271 33.3565 23.3260 15.9604 43.9760 49.7312 4.8808 46.6109 19.8625 24.1730 26.6360 10.6949 34.1650 60.1083 21.5033 21.4293 0.2697 25.5896 33.9438 24.9905
temp: 298.150 k
press: 1.00000 atm
elementType: 8 8 7 7 6 6 6 6 6 6 6 6 6 6 6 6 6 6 6 1 1 1 1 1 1 1 1 1 1 1 1 1 1 1 1 1 1 1 1 1 1
symmnumber: 1
zpe: 909225.2 jmol-1
zpe.correction: 0.346306 hartree
zpe.thermalcorrener: 0.366073 hartree
zpe.thermalcorrenthalpy: 0.367018 hartree
zpe.thermalcorrgfe: 0.295410 hartree
zpe.sumelectzpe: -843.301014 hartree
zpe.sumelectthermal: -843.281246 hartree
zpe.sumelectthermalent: -843.280302 hartree
zpe.sumelectthermalfe: -843.351910 hartree
dipole: -0.9651 1.6724 -0.7810
dipole: 2.0829
quadrupole: -104.1203 -106.7549 -120.1911
quadrupole: 3.6965 -6.5065 3.2134
quadrupole: 6.2352 3.6005 -9.8356 3.6965 -6.5065 3.2134
hfenergy: -843.6473194 hartree
pointgroup: C01 [X(C15H22N2O2)]
dipole: -0.3731398 0.6333171 -0.3621951 debye
polarizability: 246.9192948|2.7678537|186.5957397|3.606501|-5.1904285|117.4868206 unknown
InChI: InChI=1S/C15H22N2O2/c1-11-5-4-6-12(2)14(11)16-15(18)19-10-13-7-8-17(3)9-13/h4-6,13,16H,7-10H2,1-3H3
charge 0 multiplicity 1
41 atoms
O  -0.954306 -0.385996 -0.31378
O  0.541635 -1.379093 1.215857
N  -5.196933 0.761257 -0.479819
N  1.250183 0.094274 -0.503164
C  -3.356306 -0.730724 -0.376384
C  -4.608887 -1.446044 0.245434
C  -3.724168 0.773377 -0.329196
C  -5.671467 -0.32399 0.414038
C  -2.074524 -1.085805 0.372328
C  -5.860606 2.057455 -0.28787
C  0.326655 -0.630894 0.231802
C  2.662841 0.167956 -0.248046
C  3.236989 1.465559 -0.092226
C  3.46325 -1.010966 -0.210814
C  4.630618 1.568484 0.123096
C  4.852902 -0.860953 0.028096
C  2.368662 2.710738 -0.144393
C  2.877917 -2.388296 -0.444522
C  5.437051 0.411674 0.194778
H  -3.246979 -1.033787 -1.432704
H  -4.371618 -1.912919 1.219468
H  -4.968368 -2.243582 -0.425652
H  -3.401119 1.213852 0.652705
H  -3.249812 1.359248 -1.134908
H  -6.689602 -0.644622 0.128642
H  -5.708046 0.011708 1.483404
H  -1.872365 -2.17288 0.35718
H  -2.109332 -0.754348 1.428043
H  -5.46521 2.79234 -1.011801
H  -5.722123 2.476499 0.74252
H  -6.945568 1.953818 -0.469595
H  0.8460 0.739715 -1.185487
H  5.080101 2.560429 0.248912
H  5.480233 -1.759227 0.064591
H  2.948292 3.603347 0.144386
H  1.96647 2.900227 -1.16052
H  1.502559 2.62787 0.538106
H  2.153435 -2.380202 -1.280067
H  3.672811 -3.116021 -0.680375
H  2.328172 -2.738575 0.447815
H  6.514365 0.503097 0.371624
