program: Orca
programVersion: 4.2.1
elementType: Cl Cl Cl S N N N N C C C C C C C C C C C C C C C C C H H H H H H H H H H H H H
charge: 0
multiplicity: 1
keywords: wb97x-d3
keywords: def2-TZVPP
keywords: def2/J RIJCOSX GRIDX6 NOFINALGRIDX
keywords: grid4 nofinalgrid
keywords: scfconv7
keywords: smallprint printgap noloewdin
keywords: NOSOSCF
formula: C17H13Cl3N4S
InChI: InChI=1S/C17H13Cl3N4S/c18-13-3-1-12(2-4-13)9-25-17(8-24-11-21-10-22-24)23-16-6-5-14(19)7-15(16)20/h1-7,10-11H,8-9H2
38 atoms
Cl 0.867435 -1.229017 4.034157
Cl -2.534314 -0.350577 -4.289873
Cl 3.279369 -4.631772 0.654496
S  -0.944399 2.627192 1.606179
N  1.302807 2.410976 -0.590376
N  0.006925 0.17821 1.617518
N  0.973062 1.564925 -1.570129
N  0.84044 3.680057 -2.29074
C  1.547409 1.926901 0.742674
C  -2.462394 1.645089 1.370755
C  0.266466 1.37675 1.340097
C  -2.544676 1.133566 -0.034877
C  -2.433122 -0.223488 -0.30891
C  -2.677181 2.021071 -1.098918
C  0.843554 -0.900386 1.359656
C  -2.439504 -0.690295 -1.615437
C  -2.689898 1.571566 -2.40583
C  1.202914 3.672148 -1.035191
C  1.272561 -1.693977 2.425539
C  1.180924 -1.295713 0.066336
C  -2.560744 0.213342 -2.655953
C  2.027779 -2.834305 2.217466
C  1.927265 -2.440691 -0.155667
C  2.348089 -3.203023 0.920867
C  0.707733 2.366996 -2.570559
H  1.906907 2.762631 1.346254
H  2.327045 1.166078 0.723218
H  -3.274377 2.336193 1.603338
H  -2.480476 0.841901 2.105176
H  -2.324565 -0.929304 0.504103
H  -2.74535 3.08532 -0.909243
H  -2.341102 -1.747777 -1.817461
H  -2.785745 2.271397 -3.224252
H  1.404954 4.534169 -0.418278
H  0.849652 -0.693296 -0.769667
H  2.357626 -3.427206 3.058521
H  2.178694 -2.734134 -1.165124
H  0.409995 1.989933 -3.536218
totalener: -2653.51032824 hartree
nucrepener: 2784.13155220 hartree
electener: -5437.64188044 hartree
oneelecener: -9184.01993837 hartree
twoeener: 3746.37805793 hartree
kineticenergy: 2647.23729536 hartree
xcener: -168.234867938386 hartree
chargesum: -0.0000000
charge: -0.060018 -0.082914 -0.074462 -0.082529 0.134829 -0.284675 -0.321792 -0.321406 -0.168764 -0.088005 0.205751 0.055822 -0.169857 -0.190618 0.199196 -0.122546 -0.130023 0.055463 -0.074710 -0.222822 0.091595 -0.080233 -0.106467 0.059022 0.075330 0.132982 0.145026 0.139372 0.121306 0.128249 0.113384 0.123440 0.129224 0.139919 0.162376 0.114110 0.126380 0.129067
qa: -0.0600 -0.0829 -0.0745 -0.0825 0.1348 -0.2847 -0.3218 -0.3214 -0.1688 -0.0880 0.2058 0.0558 -0.1699 -0.1906 0.1992 -0.1225 -0.1300 0.0555 -0.0747 -0.2228 0.0916 -0.0802 -0.1065 0.0590 0.0753 0.1330 0.1450 0.1394 0.1213 0.1282 0.1134 0.1234 0.1292 0.1399 0.1624 0.1141 0.1264 0.1291
va: 1.2680 1.2244 1.2295 2.3324 3.2698 2.9436 2.8388 3.0549 3.9875 3.8572 3.8472 3.5898 3.9664 3.9945 3.6133 3.9802 3.9409 4.0738 4.0276 3.9563 3.8885 3.9792 4.0392 3.9183 4.0512 1.0017 0.9963 0.9993 1.0349 1.0112 1.0198 1.0115 1.0092 1.0031 1.0291 1.0246 1.0112 1.0049
dispcorr: -0.026012288 hartree
energy: -2653.536340531652
dipole: -6.59994 6.63527 0.03533 16.87683 -16.11066 0.76618 -3.06435 3.83991 0.77556
magnitude: 1.09077 au
magnitude: 2.77251 debye
