program: Orca
programVersion: 4.2.1
elementType: Cl Cl Cl S N N N N C C C C C C C C C C C C C C C C C H H H H H H H H H H H H H
charge: 0
multiplicity: 1
keywords: wb97x-d3
keywords: def2-TZVPP
keywords: def2/J RIJCOSX GRIDX6 NOFINALGRIDX
keywords: grid4 nofinalgrid
keywords: scfconv7
keywords: smallprint printgap noloewdin
keywords: NOSOSCF
formula: C17H13Cl3N4S
InChI: InChI=1S/C17H13Cl3N4S/c18-13-3-1-12(2-4-13)9-25-17(8-24-11-21-10-22-24)23-16-6-5-14(19)7-15(16)20/h1-7,10-11H,8-9H2
38 atoms
Cl 0.914882 -3.417153 0.407239
Cl -7.618307 1.369143 0.33808
Cl 6.009695 -3.367534 -1.279093
S  -0.86005 1.139344 0.668691
N  1.955979 2.457142 1.1084
N  0.930595 -0.562095 -0.22552
N  2.547097 2.776611 -0.045217
N  1.938797 4.627014 1.060976
C  1.737264 1.080975 1.463526
C  -1.80986 0.092541 -0.479666
C  0.731371 0.422121 0.5367
C  -3.262101 0.404529 -0.291933
C  -3.882758 1.398922 -1.038811
C  -4.010967 -0.280708 0.658832
C  2.159896 -1.173723 -0.420859
C  -5.221977 1.701127 -0.851912
C  -5.350152 0.007898 0.857293
C  1.590901 3.574914 1.753415
C  2.271598 -2.549687 -0.206621
C  3.27188 -0.495957 -0.919894
C  -5.948375 1.001744 0.09829
C  3.450733 -3.227227 -0.459437
C  4.455381 -1.163063 -1.186316
C  4.539231 -2.525341 -0.952147
C  2.518076 4.087012 -0.030171
H  1.353034 1.05399 2.484565
H  2.684684 0.54374 1.447879
H  -1.577947 -0.948441 -0.255933
H  -1.474015 0.295308 -1.496005
H  -3.315728 1.948335 -1.780348
H  -3.541776 -1.054371 1.254137
H  -5.696875 2.47394 -1.440028
H  -5.925001 -0.534663 1.594783
H  1.085301 3.569452 2.707108
H  3.19869 0.56819 -1.10852
H  3.516012 -4.290295 -0.276397
H  5.305837 -0.622005 -1.576483
H  2.931577 4.674264 -0.834725
totalener: -2653.51391443 hartree
nucrepener: 2560.05670482 hartree
electener: -5213.57061925 hartree
oneelecener: -8735.43260160 hartree
twoeener: 3521.86198235 hartree
kineticenergy: 2647.22057682 hartree
xcener: -168.229846291639 hartree
chargesum: -0.0000000
charge: -0.067247 -0.075960 -0.073330 -0.053297 0.122423 -0.282686 -0.330095 -0.329935 -0.168110 -0.053304 0.195710 0.006522 -0.151454 -0.162657 0.165558 -0.125954 -0.119197 0.062448 -0.036830 -0.232352 0.083564 -0.094143 -0.096124 0.055515 0.080906 0.130655 0.152636 0.110805 0.114812 0.120013 0.118676 0.123979 0.123248 0.145453 0.162948 0.115889 0.126375 0.134540
qa: -0.0672 -0.0760 -0.0733 -0.0533 0.1224 -0.2827 -0.3301 -0.3299 -0.1681 -0.0533 0.1957 0.0065 -0.1515 -0.1627 0.1656 -0.1260 -0.1192 0.0624 -0.0368 -0.2324 0.0836 -0.0941 -0.0961 0.0555 0.0809 0.1307 0.1526 0.1108 0.1148 0.1200 0.1187 0.1240 0.1232 0.1455 0.1629 0.1159 0.1264 0.1345
va: 1.2554 1.2310 1.2305 2.4311 3.2796 2.9613 2.8568 3.0661 3.9525 3.8836 3.8628 3.7051 4.0059 4.0110 3.7666 4.0042 3.9972 4.0590 4.0189 3.9660 3.9402 3.9911 4.0175 3.9343 4.0479 1.0110 0.9900 1.0239 1.0144 1.0103 1.0099 1.0114 1.0117 1.0001 1.0388 1.0222 1.0115 0.9994
dispcorr: -0.019430321 hartree
energy: -2653.533344754368
dipole: -0.69630 0.77533 0.07903 14.27541 -14.43654 -0.16114 1.14155 -0.66207 0.47947
magnitude: 0.51196 au
magnitude: 1.30130 debye
