program: Orca
programVersion: 4.2.1
elementType: Cl Cl Cl S N N N N C C C C C C C C C C C C C C C C C H H H H H H H H H H H H H
charge: 0
multiplicity: 1
keywords: wb97x-d3
keywords: def2-TZVPP
keywords: def2/J RIJCOSX GRIDX6 NOFINALGRIDX
keywords: grid4 nofinalgrid
keywords: scfconv7
keywords: smallprint printgap noloewdin
keywords: NOSOSCF
formula: C17H13Cl3N4S
InChI: InChI=1S/C17H13Cl3N4S/c18-13-3-1-12(2-4-13)9-25-17(8-24-11-21-10-22-24)23-16-6-5-14(19)7-15(16)20/h1-7,10-11H,8-9H2
38 atoms
Cl 2.668161 -0.85709 2.241653
Cl -5.153012 -1.062617 -2.720245
Cl 3.087482 -4.702005 -1.482033
S  -0.62723 2.33165 1.298047
N  1.988927 2.921444 0.233048
N  0.130022 -0.134751 0.804595
N  2.677923 3.08597 1.36639
N  2.291531 5.066006 0.385218
C  1.566362 1.61551 -0.180574
C  -2.039673 1.321719 1.833801
C  0.409669 1.082606 0.641982
C  -2.813041 0.726665 0.69479
C  -3.451559 1.541891 -0.234534
C  -2.915057 -0.651545 0.549402
C  0.876821 -1.167341 0.247687
C  -4.173735 1.000847 -1.284448
C  -3.63661 -1.209878 -0.494796
C  1.763486 4.11717 -0.338366
C  2.049736 -1.641542 0.837316
C  0.402572 -1.822979 -0.886969
C  -4.260049 -0.377685 -1.409395
C  2.730908 -2.727593 0.310977
C  1.0753 -2.903547 -1.42747
C  2.23962 -3.350995 -0.822995
C  2.83736 4.384256 1.416821
H  2.414405 0.933948 -0.128846
H  1.247853 1.667878 -1.22429
H  -2.655472 2.015862 2.409199
H  -1.678961 0.555547 2.518666
H  -3.379455 2.619377 -0.14613
H  -2.415691 -1.302289 1.254782
H  -4.667682 1.643911 -1.999661
H  -3.709211 -2.284064 -0.59568
H  1.218827 4.237313 -1.262615
H  -0.519837 -1.477116 -1.335597
H  3.638114 -3.076564 0.783464
H  0.693232 -3.396987 -2.310003
H  3.369924 4.860326 2.224962
totalener: -2653.51136285 hartree
nucrepener: 2687.61939851 hartree
electener: -5341.13076136 hartree
oneelecener: -8990.50527068 hartree
twoeener: 3649.37450932 hartree
kineticenergy: 2647.22330534 hartree
xcener: -168.231936359992 hartree
chargesum: -0.0000000
charge: -0.047701 -0.078278 -0.072417 -0.050464 0.061866 -0.296086 -0.286223 -0.326661 -0.103186 -0.067801 0.192610 0.068621 -0.191155 -0.193259 0.173719 -0.113746 -0.134775 0.058344 -0.093981 -0.197771 0.077798 -0.075453 -0.102664 0.055843 0.073213 0.144211 0.122136 0.141707 0.119255 0.114910 0.122164 0.124410 0.127707 0.140542 0.134640 0.117861 0.125810 0.134252
qa: -0.0477 -0.0783 -0.0724 -0.0505 0.0619 -0.2961 -0.2862 -0.3267 -0.1032 -0.0678 0.1926 0.0686 -0.1912 -0.1933 0.1737 -0.1137 -0.1348 0.0583 -0.0940 -0.1978 0.0778 -0.0755 -0.1027 0.0558 0.0732 0.1442 0.1221 0.1417 0.1193 0.1149 0.1222 0.1244 0.1277 0.1405 0.1346 0.1179 0.1258 0.1343
va: 1.2794 1.2291 1.2309 2.4097 3.3487 2.9719 2.8472 3.0625 3.9197 3.8275 3.9045 3.5614 4.0423 3.9534 3.7140 3.9918 3.9509 4.0675 4.0291 4.0102 3.9299 3.9885 4.0094 3.9300 4.0489 1.0062 1.0004 0.9990 1.0353 1.0184 1.0169 1.0109 1.0096 1.0018 1.0048 1.0220 1.0113 1.0001
dispcorr: -0.022121348 hartree
energy: -2653.533484201113
dipole: -6.91444 6.30845 -0.60599 15.45463 -15.52714 -0.07251 2.69086 -3.04006 -0.34919
magnitude: 0.70315 au
magnitude: 1.78726 debye
