program: Orca
programVersion: 4.2.1
elementType: Cl Cl Cl S N N N N C C C C C C C C C C C C C C C C C H H H H H H H H H H H H H
charge: 0
multiplicity: 1
keywords: wb97x-d3
keywords: def2-TZVPP
keywords: def2/J RIJCOSX GRIDX6 NOFINALGRIDX
keywords: grid4 nofinalgrid
keywords: scfconv7
keywords: smallprint printgap noloewdin
keywords: NOSOSCF
formula: C17H13Cl3N4S
InChI: InChI=1S/C17H13Cl3N4S/c18-13-3-1-12(2-4-13)9-25-17(8-24-11-21-10-22-24)23-16-6-5-14(19)7-15(16)20/h1-7,10-11H,8-9H2
38 atoms
Cl -0.173327 0.986075 2.39642
Cl 4.386887 2.999163 -0.661675
Cl 0.532853 4.230382 -1.805743
S  -0.093415 -2.297625 0.727665
N  -2.852798 -3.676402 1.180349
N  -2.138812 -0.427859 0.631057
N  -3.652646 -3.707855 0.112046
N  -2.834438 -5.752604 0.549363
C  -2.539785 -2.43653 1.839516
C  0.58261 -1.652684 -0.830488
C  -1.662915 -1.542561 0.991132
C  1.528603 -0.488776 -0.738688
C  2.296967 -0.22802 0.389407
C  1.69124 0.321664 -1.857758
C  -1.437042 0.610005 0.031705
C  3.179946 0.839479 0.418978
C  2.579707 1.384928 -1.850623
C  -2.365401 -4.893193 1.418769
C  -0.536035 1.39132 0.758378
C  -1.73443 1.001278 -1.272027
C  3.307604 1.643269 -0.70206
C  0.06301 2.511089 0.205583
C  -1.133487 2.105863 -1.846297
C  -0.239507 2.855018 -1.098073
C  -3.612214 -4.970529 -0.221721
H  -2.038743 -2.669751 2.780216
H  -3.459563 -1.907092 2.076762
H  -0.237812 -1.4521 -1.518212
H  1.108434 -2.519806 -1.238187
H  2.196569 -0.841912 1.274709
H  1.111606 0.131124 -2.752071
H  3.755408 1.041328 1.31197
H  2.681541 2.014213 -2.723478
H  -1.691242 -5.105722 2.233246
H  -2.44523 0.421176 -1.845238
H  0.761351 3.096254 0.786766
H  -1.36563 2.376452 -2.866776
H  -4.173628 -5.347866 -1.061668
elementType: Cl S N C H
totalener: -2653.52611088 hartree
nucrepener: 2832.22873990 hartree
electener: -5485.75485077 hartree
oneelecener: -9279.88421441 hartree
twoeener: 3794.12936364 hartree
cpcmener: -0.03291083 hartree
kineticenergy: 2647.26095390 hartree
xcener: -168.245537027072 hartree
chargesum: 0.0000000
charge: -0.082074 -0.104416 -0.096550 -0.088711 0.088636 -0.255992 -0.352543 -0.417889 -0.029807 -0.018927 0.089059 0.064190 -0.228539 -0.204902 0.141721 -0.120589 -0.169297 0.079262 0.022019 -0.218085 0.110567 -0.099586 -0.114199 0.085769 0.070008 0.145300 0.122154 0.126612 0.157649 0.125914 0.142702 0.140435 0.138459 0.182041 0.143654 0.119433 0.142647 0.163876
qa: -0.0821 -0.1044 -0.0965 -0.0887 0.0886 -0.2560 -0.3525 -0.4179 -0.0298 -0.0189 0.0891 0.0642 -0.2285 -0.2049 0.1417 -0.1206 -0.1693 0.0793 0.0220 -0.2181 0.1106 -0.0996 -0.1142 0.0858 0.0700 0.1453 0.1222 0.1266 0.1576 0.1259 0.1427 0.1404 0.1385 0.1820 0.1437 0.1194 0.1426 0.1639
va: 1.2396 1.2026 1.2106 2.3850 3.3716 3.0338 2.8778 3.0221 3.7875 3.8297 4.0553 3.5872 3.9196 3.9281 3.7861 3.9563 3.8928 4.0482 3.9319 3.9884 3.7547 3.9404 3.9436 3.7840 4.0487 0.9984 1.0293 1.0165 0.9919 1.0324 1.0007 1.0074 1.0165 0.9907 1.0114 1.0185 1.0041 0.9943
dispcorr: -0.027636975 hartree
energy: -2653.553747852198
dipole: -9.99925 10.25155 0.25230 -21.09698 20.51342 -0.58356 -3.22441 3.30637 0.08196
magnitude: 0.64103 au
magnitude: 1.62936 debye
