program: Orca
programVersion: 4.2.1
elementType: Cl Cl Cl S N N N N C C C C C C C C C C C C C C C C C H H H H H H H H H H H H H
charge: 0
multiplicity: 1
keywords: wb97x-d3
keywords: def2-TZVPP
keywords: def2/J RIJCOSX GRIDX6 NOFINALGRIDX
keywords: grid4 nofinalgrid
keywords: scfconv7
keywords: smallprint printgap noloewdin
keywords: NOSOSCF
formula: C17H13Cl3N4S
InChI: InChI=1S/C17H13Cl3N4S/c18-13-3-1-12(2-4-13)9-25-17(8-24-11-21-10-22-24)23-16-6-5-14(19)7-15(16)20/h1-7,10-11H,8-9H2
38 atoms
Cl -0.285622 1.191934 1.722196
Cl 4.087863 2.301222 1.867645
Cl -1.33223 4.099671 -2.662083
S  0.434152 -2.707239 -1.511887
N  -2.038441 -3.226545 1.524571
N  -1.135858 -1.089596 0.116877
N  -3.210523 -3.751005 1.15325
N  -3.463087 -2.454998 2.969296
C  -0.859757 -3.379384 0.72382
C  1.33278 -1.252618 -2.116699
C  -0.624057 -2.196696 -0.195527
C  1.985985 -0.392425 -1.074835
C  2.075416 0.976555 -1.303495
C  2.55442 -0.914157 0.081914
C  -1.120462 0.094659 -0.591405
C  2.720899 1.812628 -0.407139
C  3.20383 -0.092313 0.989231
C  -2.210529 -2.442778 2.588171
C  -0.806932 1.27753 0.083509
C  -1.528344 0.190652 -1.920517
C  3.281344 1.266886 0.73528
C  -0.864992 2.508399 -0.54221
C  -1.598167 1.414808 -2.56423
C  -1.261015 2.564148 -1.86885
C  -4.023823 -3.266903 2.052715
H  -0.945329 -4.309258 0.163038
H  0.010131 -3.482397 1.374636
H  0.697148 -0.660244 -2.772142
H  2.093747 -1.711254 -2.754105
H  1.633913 1.404753 -2.195016
H  2.500011 -1.975611 0.288646
H  2.776645 2.875385 -0.598401
H  3.640895 -0.51299 1.884249
H  -1.403847 -1.901969 3.055783
H  -1.811101 -0.706338 -2.456644
H  -0.595508 3.406655 -0.004837
H  -1.914898 1.463296 -3.59655
H  -5.073006 -3.516529 2.053937
elementType: Cl S N C H
totalener: -2653.52742433 hartree
nucrepener: 2818.31180814 hartree
electener: -5471.83923247 hartree
oneelecener: -9251.77169071 hartree
twoeener: 3779.93245824 hartree
cpcmener: -0.03301004 hartree
kineticenergy: 2647.25601718 hartree
xcener: -168.244925394075 hartree
chargesum: -0.0000000
charge: -0.076538 -0.104329 -0.092285 -0.085094 0.094017 -0.284279 -0.359781 -0.420214 -0.023086 -0.056398 0.130999 0.041784 -0.208652 -0.174290 0.149427 -0.151302 -0.159102 0.087110 0.048325 -0.264034 0.106601 -0.117118 -0.112301 0.067269 0.067459 0.129319 0.143255 0.136908 0.161348 0.147494 0.136530 0.137967 0.142690 0.161078 0.168213 0.120000 0.148168 0.162838
qa: -0.0765 -0.1043 -0.0923 -0.0851 0.0940 -0.2843 -0.3598 -0.4202 -0.0231 -0.0564 0.1310 0.0418 -0.2087 -0.1743 0.1494 -0.1513 -0.1591 0.0871 0.0483 -0.2640 0.1066 -0.1171 -0.1123 0.0673 0.0675 0.1293 0.1433 0.1369 0.1613 0.1475 0.1365 0.1380 0.1427 0.1611 0.1682 0.1200 0.1482 0.1628
va: 1.2470 1.2000 1.2110 2.3921 3.3762 2.9835 2.8700 3.0201 3.8325 3.8768 4.0192 3.5806 3.9393 3.9620 3.6946 3.9928 4.0263 4.0716 3.9154 4.0320 3.7898 3.9721 3.9853 3.8239 4.0517 1.0129 0.9959 1.0068 0.9917 0.9914 1.0166 1.0089 1.0055 1.0069 0.9973 1.0249 1.0036 0.9945
dispcorr: -0.026739753 hartree
energy: -2653.554164079367
dipole: -1.71956 3.54962 1.83006 -19.26780 18.24279 -1.02501 -6.29501 4.30863 -1.98638
magnitude: 2.88885 au
magnitude: 7.34288 debye
