program: Orca
programVersion: 4.2.1
elementType: Cl Cl Cl S N N N N C C C C C C C C C C C C C C C C C H H H H H H H H H H H H H
charge: 0
multiplicity: 1
keywords: wb97x-d3
keywords: def2-TZVPP
keywords: def2/J RIJCOSX GRIDX6 NOFINALGRIDX
keywords: grid4 nofinalgrid
keywords: scfconv7
keywords: smallprint printgap noloewdin
keywords: NOSOSCF
formula: C17H13Cl3N4S
InChI: InChI=1S/C17H13Cl3N4S/c18-13-3-1-12(2-4-13)9-25-17(8-24-11-21-10-22-24)23-16-6-5-14(19)7-15(16)20/h1-7,10-11H,8-9H2
38 atoms
Cl -0.81776 -0.281425 -1.916648
Cl 3.641131 3.501569 -1.675388
Cl 0.251088 4.278248 0.684981
S  0.922624 -2.732501 0.266258
N  -2.967347 -3.509913 0.232142
N  -1.433102 -1.370795 0.790895
N  -3.792773 -3.713266 1.261532
N  -4.893399 -2.79024 -0.464325
C  -1.552718 -3.718702 0.337578
C  1.843387 -1.469292 1.188383
C  -0.793321 -2.421255 0.516533
C  2.26815 -0.243436 0.4297
C  2.463634 -0.23611 -0.945903
C  2.543612 0.915648 1.148175
C  -0.951476 -0.071809 0.779217
C  2.888968 0.909759 -1.599119
C  2.981692 2.06641 0.513212
C  -3.630897 -2.945003 -0.7746
C  -0.677654 0.579641 -0.426093
C  -0.881176 0.676405 1.952621
C  3.137228 2.055892 -0.862136
C  -0.319187 1.916399 -0.464915
C  -0.513408 2.009139 1.934885
C  -0.23389 2.618653 0.722353
C  -4.9299 -3.277032 0.789971
H  -1.19442 -4.234626 -0.555603
H  -1.36241 -4.37961 1.181985
H  2.728188 -2.015575 1.524903
H  1.292159 -1.214448 2.092473
H  2.262749 -1.121975 -1.533686
H  2.408201 0.931732 2.222226
H  3.018672 0.90374 -2.672637
H  3.175739 2.962246 1.085856
H  -3.163031 -2.675021 -1.70834
H  -1.113438 0.198271 2.894805
H  -0.104607 2.394136 -1.4102
H  -0.448846 2.56226 2.861345
H  -5.83338 -3.317796 1.377569
elementType: Cl S N C H
totalener: -2653.52566799 hartree
nucrepener: 2852.16818743 hartree
electener: -5505.69385542 hartree
oneelecener: -9319.73277286 hartree
twoeener: 3814.03891744 hartree
cpcmener: -0.03374517 hartree
kineticenergy: 2647.26498278 hartree
xcener: -168.248984993166 hartree
chargesum: -0.0000000
charge: -0.085347 -0.104348 -0.098425 -0.087434 0.116299 -0.285044 -0.360544 -0.417390 -0.061746 -0.018150 0.135767 0.062328 -0.228442 -0.202277 0.164283 -0.118654 -0.170010 0.077355 -0.009024 -0.223688 0.107685 -0.098166 -0.108651 0.083507 0.062331 0.152714 0.141067 0.159485 0.126804 0.124273 0.141570 0.140813 0.138363 0.165977 0.148731 0.121073 0.142981 0.163931
qa: -0.0853 -0.1043 -0.0984 -0.0874 0.1163 -0.2850 -0.3605 -0.4174 -0.0617 -0.0182 0.1358 0.0623 -0.2284 -0.2023 0.1643 -0.1187 -0.1700 0.0774 -0.0090 -0.2237 0.1077 -0.0982 -0.1087 0.0835 0.0623 0.1527 0.1411 0.1595 0.1268 0.1243 0.1416 0.1408 0.1384 0.1660 0.1487 0.1211 0.1430 0.1639
va: 1.2381 1.2030 1.2082 2.3843 3.3631 3.0099 2.8799 3.0242 3.8162 3.8207 4.0167 3.5899 3.9238 3.9326 3.6992 3.9557 3.8966 4.0593 3.9724 3.9828 3.7626 3.9346 3.9402 3.7792 4.0536 0.9951 1.0139 0.9914 1.0158 1.0338 1.0010 1.0071 1.0163 1.0024 1.0086 1.0177 1.0039 0.9943
dispcorr: -0.028160048 hartree
energy: -2653.553828032907
dipole: -2.67679 4.78268 2.10589 -18.53898 17.21571 -1.32327 10.78357 -9.76291 1.02066
magnitude: 2.68841 au
magnitude: 6.83339 debye
