program: Gaussian 09
title: 000030545
version: EM64L-G09RevD.01
frameworkgroup: C1[X(C20H11Br)]
method: RPBEPBE
basis: SDD
operation: Freq
keyword: #p
keyword: freq=noraman
keyword: PBEPBE/SDD
title: #p freq=noraman PBEPBE/SDD
converged: YES YES NO YES
title: Mulliken charges:
elementType: Br C C C C C C C C C C C C C C C C C C C C H H H H H H H H H H H
charge: 0.024888 0.011333 -0.004939 0.291301 0.806242 0.185667 0.491818 0.485696 0.726463 -1.110724 -0.444700 -0.531444 -0.521240 -0.501719 -0.465895 -0.465698 -0.358087 -0.480661 -0.245318 -0.270107 -0.261753 0.226095 0.256127 0.239512 0.240720 0.245301 0.244721 0.229249 0.260216 0.230033 0.231961 0.234941
chargesum: 0.00000
title: Mulliken charges with hydrogens summed into heavy atoms:
elementType: Br C C C C C C C C C C C C C C C C C C C C
charge: 0.024888 0.011333 -0.004939 0.291301 0.806242 0.185667 0.491818 0.485696 0.726463 -1.110724 -0.218605 -0.275317 -0.281728 -0.260999 -0.220593 -0.220976 -0.128838 -0.220445 -0.015285 -0.038147 -0.026812
polarizability: 4.38558697e+02 3.20406573e+01 2.87567793e+02 -7.95964021e-03 7.28813632e-03 8.24157292e+01
1716.lowfreq: -10.2141 -4.8079 -0.0010 0.0002 0.0003 6.7081 46.1620 64.9103 101.3158
frequency: 46.1337 64.9084 101.3148 161.1287 162.7276 184.7402 198.9257 223.7621 256.6083 291.2146 330.7259 333.3902 393.0136 408.3703 454.2228 465.8849 492.5406 513.6236 520.6305 521.5814 533.4901 566.5849 584.1252 598.7455 628.4131 635.1968 700.3471 704.0915 719.4621 770.6091 770.9880 774.7388 787.2138 808.4379 843.6298 860.5010 866.2570 874.7443 892.5610 918.1750 963.0482 971.2094 983.2912 987.2252 991.9799 996.4102 1011.9064 1024.0615 1045.7924 1081.2829 1115.9532 1134.4385 1161.4861 1181.6648 1184.7833 1202.1950 1232.2948 1250.7787 1262.1757 1282.6855 1315.4215 1320.8947 1371.6369 1388.2176 1398.0179 1415.4981 1422.5878 1427.9741 1430.7203 1459.5810 1475.0660 1496.5380 1517.7796 1554.5196 1583.2263 1590.8005 1606.2058 1618.0806 1635.7203 3125.1785 3129.3478 3131.6826 3134.1098 3134.7030 3149.6031 3159.0679 3161.7479 3170.3108 3171.3900 3176.4771
redmass: 5.8371 5.4219 4.0146 12.7649 4.7771 4.0308 8.4156 4.2287 7.8456 4.4865 4.5682 7.3856 5.7930 3.6478 4.7708 3.3924 7.6283 3.7694 6.6685 3.4727 5.3138 3.1298 7.1026 3.5543 7.2159 6.9933 3.1439 6.4727 3.0382 1.2347 6.7175 1.4781 2.0964 5.1143 1.5035 5.7979 2.3375 1.7380 6.5856 1.4679 1.3975 1.4663 6.4174 1.4296 1.4837 1.3546 3.3646 5.6141 2.1990 2.0730 2.4946 1.9718 1.3259 1.1926 1.1924 1.2837 1.7752 1.7835 1.8544 2.4488 3.3804 2.2534 3.4966 3.9748 2.5923 3.5769 3.9924 2.8134 4.2683 3.0515 3.4542 4.6482 3.8391 6.9501 7.5115 6.0844 6.6014 6.0720 7.2382 1.0863 1.0883 1.0891 1.0866 1.0907 1.0900 1.0991 1.0961 1.0936 1.0946 1.0972
irintensity: 0.1934 0.4129 0.1074 0.2197 2.7495 0.0676 2.5903 6.7979 0.5976 0.0000 0.0721 0.4584 1.4405 2.8618 0.7225 2.6719 0.8618 3.3054 0.3465 0.0052 1.9653 1.9052 0.1200 0.0506 3.5840 10.8023 0.0271 2.0886 22.6302 0.3394 30.9903 123.0014 3.9454 4.1664 1.6133 9.3445 11.6913 78.2055 29.3332 0.7828 3.0024 2.4503 16.7700 6.5641 3.1015 0.8438 12.4287 0.5279 11.8496 6.0237 3.6365 0.2732 3.1236 1.1621 0.7191 19.8445 1.6899 22.2074 18.1620 3.4409 32.8491 0.3630 0.1207 2.3936 20.3712 1.5680 7.5667 0.9604 6.3577 25.7208 1.5388 2.5560 7.2933 9.1212 2.7911 7.7030 3.6796 3.5838 1.4100 0.4714 2.7816 2.7977 0.9195 28.6436 12.0425 41.9908 3.3006 21.6502 21.5117 34.2321
temp: 298.150 k
press: 1.00000 atm
elementType: 35 6 6 6 6 6 6 6 6 6 6 6 6 6 6 6 6 6 6 6 6 1 1 1 1 1 1 1 1 1 1 1
symmnumber: 1
zpe: 632229.5 jmol-1
zpe.correction: 0.240804 hartree
zpe.thermalcorrener: 0.255340 hartree
zpe.thermalcorrenthalpy: 0.256284 hartree
zpe.thermalcorrgfe: 0.198793 hartree
zpe.sumelectzpe: -780.875356 hartree
zpe.sumelectthermal: -780.860820 hartree
zpe.sumelectthermalent: -780.859876 hartree
zpe.sumelectthermalfe: -780.917367 hartree
dipole: -1.5073 1.5515 0.0000
dipole: 2.1631
quadrupole: -110.2261 -111.3349 -138.4380
quadrupole: 4.8619 -0.0004 0.0008
quadrupole: 9.7736 8.6648 -18.4384 4.8619 -0.0004 0.0008
hfenergy: -781.1161599 hartree
pointgroup: C01 [X(C20H11Br1)]
dipole: 0.3935455 0.7545706 0.0000009 debye
polarizability: 443.7652653|14.6065356|282.3612241|-0.0055413|-0.0092611|82.4157292 unknown
InChI: InChI=1S/C20H11Br/c21-20-16-7-2-1-6-14(16)15-10-8-12-4-3-5-13-9-11-17(20)19(15)18(12)13/h1-11H
charge 0 multiplicity 1
32 atoms
Br -2.298399 -3.443312 0.000096
C  0.397819 -0.101476 0.000071
C  1.828873 0.083922 0.000061
C  -0.474582 1.035829 0.000035
C  -0.146574 -1.45736 0.000112
C  -1.913373 0.839907 0.000062
C  2.38921 1.412813 0.000002
C  2.720611 -1.049655 0.000106
C  -2.461963 -0.507196 0.000085
C  -1.547558 -1.613184 0.0001
C  0.117179 2.351837 -0.000032
C  0.782902 -2.572226 0.000165
C  1.489896 2.535953 -0.00005
C  2.147049 -2.378505 0.000165
C  3.804716 1.582012 -0.000011
C  4.122541 -0.841831 0.000092
C  -2.832989 1.939039 0.000072
C  -3.888167 -0.674941 0.000102
C  4.660544 0.466313 0.000032
C  -4.215529 1.745768 0.000092
C  -4.748247 0.422024 0.000104
H  -0.527397 3.234447 -0.000081
H  0.374567 -3.585874 0.00021
H  1.91101 3.547957 -0.000106
H  2.825016 -3.239903 0.000213
H  4.218162 2.597121 -0.000057
H  4.790503 -1.710959 0.000127
H  -2.449316 2.962503 0.000073
H  -4.297971 -1.68821 0.000117
H  5.746382 0.609037 0.000021
H  -4.890645 2.608169 0.000101
H  -5.83237 0.267381 0.000121
