program: Orca
programVersion: 4.2.1
elementType: Cl Cl Cl S N N N N C C C C C C C C C C C C C C C C C H H H H H H H H H H H H H
charge: 0
multiplicity: 1
keywords: wb97x-d3
keywords: def2-TZVPP
keywords: def2/J RIJCOSX GRIDX6 NOFINALGRIDX
keywords: grid4 nofinalgrid
keywords: scfconv7
keywords: smallprint printgap noloewdin
keywords: NOSOSCF
formula: C17H13Cl3N4S
InChI: InChI=1S/C17H13Cl3N4S/c18-13-3-1-12(2-4-13)9-25-17(8-24-11-21-10-22-24)23-16-6-5-14(19)7-15(16)20/h1-7,10-11H,8-9H2
38 atoms
Cl 0.381811 1.927883 1.904745
Cl 4.755701 1.925078 0.955374
Cl -0.850075 4.376836 -2.702803
S  -0.630659 -2.395217 -0.579722
N  -2.298468 -3.559211 1.474983
N  -1.408116 -0.204373 0.961043
N  -3.506146 -3.52524 0.904705
N  -2.685573 -5.615042 0.896239
C  -1.648302 -2.355582 1.919066
C  0.40655 -1.327055 -1.614207
C  -1.265778 -1.445266 0.770329
C  1.467547 -0.526804 -0.916602
C  2.128708 -0.979306 0.21959
C  1.842779 0.695488 -1.464985
C  -1.223003 0.816548 0.047179
C  3.144073 -0.233487 0.797209
C  2.853678 1.454575 -0.89923
C  -1.820955 -4.804918 1.451932
C  -0.464321 1.933021 0.405753
C  -1.889908 0.847894 -1.17623
C  3.496678 0.980317 0.231887
C  -0.342275 3.027245 -0.430124
C  -1.783631 1.935471 -2.026396
C  -1.004783 3.015854 -1.646391
C  -3.692532 -4.776892 0.581004
H  -0.749101 -2.641276 2.465728
H  -2.300568 -1.815129 2.600882
H  -0.212219 -0.692753 -2.245416
H  0.873114 -2.060153 -2.278343
H  1.856048 -1.925338 0.670049
H  1.335172 1.070799 -2.345077
H  3.647391 -0.597031 1.682413
H  3.127229 2.406692 -1.332748
H  -0.855225 -5.068914 1.853112
H  -2.51561 0.011424 -1.46115
H  0.270045 3.869018 -0.138976
H  -2.306068 1.933751 -2.97263
H  -4.598825 -5.105057 0.097226
elementType: Cl S N C H
totalener: -2653.52669967 hartree
nucrepener: 2795.82781598 hartree
electener: -5449.35451565 hartree
oneelecener: -9206.85769789 hartree
twoeener: 3757.50318225 hartree
cpcmener: -0.03328795 hartree
kineticenergy: 2647.24689840 hartree
xcener: -168.241901054318 hartree
chargesum: -0.0000000
charge: -0.077795 -0.104521 -0.092090 -0.099106 0.066697 -0.273036 -0.346511 -0.412530 -0.016820 -0.047164 0.098689 0.051804 -0.178519 -0.218234 0.154052 -0.163103 -0.147061 0.084648 0.048127 -0.226185 0.110430 -0.128609 -0.133836 0.078760 0.071118 0.136605 0.121141 0.138199 0.160543 0.134040 0.145372 0.141776 0.137367 0.183410 0.168395 0.120807 0.148061 0.165079
qa: -0.0778 -0.1045 -0.0921 -0.0991 0.0667 -0.2730 -0.3465 -0.4125 -0.0168 -0.0472 0.0987 0.0518 -0.1785 -0.2182 0.1541 -0.1631 -0.1471 0.0846 0.0481 -0.2262 0.1104 -0.1286 -0.1338 0.0788 0.0711 0.1366 0.1211 0.1382 0.1605 0.1340 0.1454 0.1418 0.1374 0.1834 0.1684 0.1208 0.1481 0.1651
va: 1.2444 1.2000 1.2115 2.4072 3.3776 3.0293 2.8604 3.0237 3.8172 3.8825 4.0390 3.5660 3.9665 3.9424 3.7682 4.0211 3.9808 4.0395 3.8950 3.9859 3.7860 3.9839 3.9924 3.8082 4.0481 0.9964 1.0259 1.0054 0.9907 1.0168 0.9923 1.0064 1.0092 0.9895 0.9962 1.0245 1.0039 0.9940
dispcorr: -0.026338991 hartree
energy: -2653.553038661724
dipole: -7.93348 8.59441 0.66093 -21.05719 20.52805 -0.52914 -3.32309 2.74543 -0.57766
magnitude: 1.02494 au
magnitude: 2.60520 debye
