program: Gaussian 09
title: 000030382
version: EM64L-G09RevD.01
frameworkgroup: C1[X(C15H24N)]
method: RPBEPBE
basis: SDD
operation: Freq
keyword: #p
keyword: freq=noraman
keyword: PBEPBE/SDD
title: #p freq=noraman PBEPBE/SDD
converged: NO YES NO NO
title: Mulliken charges:
elementType: N C C C C C C C C C C C C C C C H H H H H H H H H H H H H H H H H H H H H H H H
charge: -0.148841 0.442291 -0.518961 -0.495232 -0.440746 -0.473399 -0.695397 -0.603466 -0.607538 -0.574694 0.538511 -0.421140 -0.402129 -0.230637 -0.238880 -0.224553 0.253437 0.210441 0.230517 0.240993 0.264123 0.249122 0.252514 0.272398 0.240032 0.227059 0.283163 0.285412 0.261135 0.265796 0.278646 0.271836 0.269608 0.281619 0.257233 0.232702 0.225704 0.245325 0.244964 0.251030
chargesum: 1.00000
title: Mulliken charges with hydrogens summed into heavy atoms:
elementType: N C C C C C C C C C C C C C C C
charge: -0.148841 0.442291 -0.055083 -0.023722 0.072499 0.051512 -0.228306 0.226244 0.208740 0.233766 0.538511 -0.188438 -0.176425 0.014688 0.006084 0.026478
polarizability: 1.99192522e+02 9.68749928e+00 1.22697629e+02 1.33035068e+00 -4.23065594e+00 1.47115668e+02
1716.lowfreq: -18.8140 -8.4844 -0.0009 -0.0005 0.0000 12.7890 15.6207 63.8461 76.5542
frequency: -4.5071 63.7668 76.5245 92.1494 104.6312 151.6500 197.2657 205.6325 233.9259 248.3671 263.7602 280.5025 319.3882 321.6748 354.3974 366.5694 394.3452 406.6020 411.7672 446.0234 456.2439 510.0664 543.0030 581.2667 618.1260 636.6278 706.7940 714.7144 742.1987 769.2119 779.0505 788.0013 804.4869 844.9499 859.5236 889.8716 902.9440 924.7743 932.6106 936.3717 969.0563 981.6971 985.9847 991.1415 1007.8859 1029.3761 1035.8370 1041.9351 1045.3541 1072.1450 1093.3792 1094.9659 1109.6460 1130.4514 1180.4073 1194.3571 1195.7379 1200.0032 1208.9549 1214.3247 1220.9250 1232.9802 1236.9610 1256.2119 1272.3415 1277.5021 1297.5334 1314.3197 1326.8898 1333.1068 1339.9457 1384.7191 1417.3045 1421.9104 1443.7699 1453.0950 1453.6640 1458.4199 1466.5090 1474.0540 1477.0607 1479.3164 1482.2472 1485.4073 1490.4513 1495.2410 1500.3500 1505.2144 1594.2616 1611.2390 2999.2654 3009.8838 3022.3664 3028.4067 3029.7327 3033.7019 3037.2508 3043.9269 3063.1328 3068.5460 3078.2590 3091.6872 3112.3701 3114.8141 3117.7195 3135.8185 3139.1535 3142.7057 3145.6865 3156.5658 3160.4316 3166.4837 3168.0479 3174.6150
redmass: 3.2002 2.8379 2.8656 3.0659 2.2459 2.2240 3.8007 1.1703 3.7647 1.7401 1.6160 2.1999 1.5835 1.8655 2.4194 2.2316 1.9922 2.7811 2.4501 2.7113 2.6656 2.8521 2.5621 5.0301 6.1943 3.2378 2.4853 1.6959 3.9596 1.4621 3.4430 1.5811 1.8538 3.8035 1.2447 2.9923 1.9145 1.4325 2.7736 2.6657 1.8430 1.6808 1.7113 5.9720 1.3290 2.2399 1.4722 1.7810 1.4110 1.7870 2.5075 1.4654 1.4146 1.6915 1.0546 1.2842 1.1674 1.4060 1.7978 1.8211 2.0011 1.7487 1.2477 1.6915 1.3486 1.3811 1.2415 1.2428 1.3958 1.4130 1.3061 6.1130 1.1325 1.1429 1.9546 1.1321 1.1029 1.0733 1.0798 1.0612 1.0592 1.1175 1.4127 1.0991 1.3219 1.0762 1.0767 1.0524 5.8369 6.0595 1.0580 1.0616 1.0596 1.0331 1.0613 1.0339 1.0351 1.0641 1.1011 1.0997 1.1018 1.1033 1.1040 1.0895 1.0890 1.1036 1.1024 1.1025 1.0892 1.0950 1.1049 1.1046 1.1047 1.1012
irintensity: 0.1474 0.2654 0.3354 0.0274 0.2945 0.0579 0.7126 0.1262 2.5424 0.1462 0.2187 0.3720 0.0890 0.0968 0.2599 0.3464 0.4751 0.0317 1.0192 0.9016 0.2516 5.9914 2.4083 8.4941 0.0354 2.1042 14.0143 67.9246 20.4292 18.0851 45.0166 10.0591 12.5111 3.7321 0.0390 1.7440 0.2328 3.0334 15.5902 12.0924 7.8882 3.3170 2.3457 2.4365 0.0694 3.6690 0.7805 1.5223 0.4261 3.2378 3.8771 3.5139 5.4367 8.7119 0.0359 1.9625 0.3103 4.1134 0.0766 0.4860 0.4585 4.6492 3.2778 6.0357 0.5178 0.1925 5.1070 7.8153 6.8896 12.2135 2.3162 0.1099 20.7537 25.4120 4.5934 17.3441 6.5572 14.2493 4.0992 10.1549 3.6344 10.0421 26.2082 24.9885 7.3855 16.8190 23.3203 70.0442 2.5881 1.7227 21.3873 30.3292 20.4729 4.4029 27.6471 4.6139 15.2511 23.0822 7.2352 9.7343 13.2635 1.5125 43.0315 10.8449 14.7190 4.6716 2.7339 10.6837 1.8112 17.0150 1.1302 3.9814 4.3387 9.8765
temp: 298.150 k
press: 1.00000 atm
elementType: 7 6 6 6 6 6 6 6 6 6 6 6 6 6 6 6 1 1 1 1 1 1 1 1 1 1 1 1 1 1 1 1 1 1 1 1 1 1 1 1
symmnumber: 1
zpe: 945683.5 jmol-1
zpe.correction: 0.360192 hartree
zpe.thermalcorrener: 0.375372 hartree
zpe.thermalcorrenthalpy: 0.376317 hartree
zpe.thermalcorrgfe: 0.319393 hartree
zpe.sumelectzpe: -639.248395 hartree
zpe.sumelectthermal: -639.233214 hartree
zpe.sumelectthermalent: -639.232270 hartree
zpe.sumelectthermalfe: -639.289194 hartree
dipole: -8.4603 -1.1575 -0.0386
dipole: 8.5392
quadrupole: -49.4823 -89.3641 -84.1874
quadrupole: 6.6296 0.5182 -0.9919
quadrupole: 24.8623 -15.0195 -9.8428 6.6296 0.5182 -0.9919
hfenergy: -639.6085869 hartree
pointgroup: C01 [X(C15H24N1)]
dipole: -3.33783 -0.3780219 0.0523957 debye
polarizability: 199.5809736|8.0907598|121.6270439|-0.2373961|0.8643249|147.7978014 unknown
InChI: InChI=1S/C15H24N/c1-16(2,3)15(11-7-8-12-15)13-14-9-5-4-6-10-14/h4-6,9-10H,7-8,11-13H2,1-3H3
charge 1 multiplicity 1
40 atoms
N  -2.712703 -0.421971 0.052496
C  -1.182024 0.161496 -0.057156
C  -0.931955 1.173766 1.10181
C  -1.010236 0.999177 -1.360579
C  0.038954 2.252974 0.532389
C  0.063644 2.073295 -1.019509
C  -0.216932 -1.076117 -0.021592
C  -2.95214 -1.541402 -0.961483
C  -3.769563 0.653845 -0.221279
C  -2.981418 -0.973535 1.454496
C  1.280297 -0.76699 0.030679
C  2.045778 -0.724712 -1.163037
C  1.947806 -0.603549 1.271878
C  3.438482 -0.491718 -1.121239
C  3.340103 -0.368776 1.318041
C  4.088956 -0.305903 0.120365
H  -0.517912 0.678349 1.9958
H  -1.871594 1.664191 1.415736
H  -1.946468 1.514248 -1.632559
H  -0.713629 0.374515 -2.221342
H  1.050513 2.118131 0.946334
H  -0.300589 3.262691 0.81886
H  -0.151921 3.016989 -1.548014
H  1.059529 1.736009 -1.343844
H  -0.397566 -1.685627 -0.924493
H  -0.456123 -1.702104 0.858007
H  -2.625619 -1.203682 -1.955711
H  -2.400417 -2.443133 -0.66579
H  -4.030475 -1.766184 -0.982246
H  -4.739824 0.27925 0.141449
H  -3.516822 1.582487 0.307167
H  -3.841628 0.843348 -1.300249
H  -2.215249 -1.712081 1.722788
H  -2.975505 -0.149209 2.180506
H  -3.970216 -1.459252 1.455363
H  1.557242 -0.891233 -2.131721
H  1.387275 -0.683376 2.212088
H  4.015444 -0.468413 -2.051612
H  3.841304 -0.250677 2.284427
H  5.1694 -0.132719 0.155175
