program: Orca
programVersion: 4.2.1
elementType: Cl Cl Cl S N N N N C C C C C C C C C C C C C C C C C H H H H H H H H H H H H H
charge: 0
multiplicity: 1
keywords: wb97x-d3
keywords: def2-TZVPP
keywords: def2/J RIJCOSX GRIDX6 NOFINALGRIDX
keywords: grid4 nofinalgrid
keywords: scfconv7
keywords: smallprint printgap noloewdin
keywords: NOSOSCF
formula: C17H13Cl3N4S
InChI: InChI=1S/C17H13Cl3N4S/c18-13-3-1-12(2-4-13)9-25-17(8-24-11-21-10-22-24)23-16-6-5-14(19)7-15(16)20/h1-7,10-11H,8-9H2
38 atoms
Cl -2.416689 0.953078 2.559175
Cl 4.717942 1.010064 -3.109289
Cl -2.959215 4.861028 -1.087537
S  0.594854 -2.39971 1.269743
N  -2.03685 -2.875361 0.243597
N  -0.062457 0.116099 0.898627
N  -1.720278 -3.874534 -0.585767
N  -2.697655 -4.668982 1.27364
C  -1.668166 -1.510163 -0.016361
C  2.120161 -1.506201 1.69159
C  -0.418151 -1.082594 0.720889
C  2.779031 -0.881721 0.498018
C  2.986202 0.491737 0.443012
C  3.193969 -1.662962 -0.576523
C  -0.798669 1.18941 0.410294
C  3.587871 1.082047 -0.658754
C  3.793148 -1.090873 -1.687224
C  -2.607011 -3.366263 1.346608
C  -1.88554 1.722151 1.103951
C  -0.397246 1.828532 -0.761613
C  3.980762 0.28269 -1.719044
C  -2.555355 2.848869 0.655048
C  -1.055538 2.950681 -1.231046
C  -2.131431 3.453173 -0.515868
C  -2.140254 -4.921003 0.073091
H  -2.50473 -0.863793 0.245916
H  -1.501249 -1.398544 -1.08797
H  2.754203 -2.275496 2.136737
H  1.906815 -0.771188 2.465606
H  2.670992 1.117599 1.266942
H  3.043573 -2.735441 -0.558947
H  3.737461 2.152666 -0.687551
H  4.106849 -1.710807 -2.515752
H  -2.941719 -2.743288 2.161751
H  0.453328 1.437651 -1.304454
H  -3.395424 3.240836 1.211538
H  -0.726263 3.426658 -2.143981
H  -2.044577 -5.915802 -0.332078
elementType: Cl S N C H
totalener: -2653.52978005 hartree
nucrepener: 2696.74404775 hartree
electener: -5350.27382780 hartree
oneelecener: -9008.42744234 hartree
twoeener: 3658.15361454 hartree
cpcmener: -0.02913679 hartree
kineticenergy: 2647.24458377 hartree
xcener: -168.236525586871 hartree
chargesum: 0.0000000
charge: -0.082106 -0.104717 -0.093531 -0.077607 0.080112 -0.297785 -0.343882 -0.405038 -0.084222 -0.028405 0.166509 0.071193 -0.206352 -0.222323 0.183860 -0.147972 -0.134114 0.089417 -0.072813 -0.212731 0.088636 -0.081919 -0.119476 0.061087 0.072570 0.162236 0.146449 0.155858 0.118412 0.133975 0.135795 0.145066 0.146664 0.166894 0.149311 0.128189 0.147492 0.165268
qa: -0.0821 -0.1047 -0.0935 -0.0776 0.0801 -0.2978 -0.3439 -0.4050 -0.0842 -0.0284 0.1665 0.0712 -0.2064 -0.2223 0.1839 -0.1480 -0.1341 0.0894 -0.0728 -0.2127 0.0886 -0.0819 -0.1195 0.0611 0.0726 0.1622 0.1464 0.1559 0.1184 0.1340 0.1358 0.1451 0.1467 0.1669 0.1493 0.1282 0.1475 0.1653
va: 1.2429 1.2004 1.2088 2.3962 3.3392 2.9977 2.8636 3.0327 3.8611 3.8051 3.9537 3.5251 3.9345 4.0146 3.7250 3.9325 3.9664 4.0531 3.9773 3.9964 3.8183 4.0041 3.9908 3.8519 4.0367 0.9924 1.0069 0.9977 1.0347 1.0140 1.0132 1.0042 1.0035 1.0010 1.0001 1.0176 1.0033 0.9938
dispcorr: -0.022402636 hartree
energy: -2653.552182684485
dipole: 6.21328 -5.91032 0.30296 -15.70678 16.24297 0.53618 2.84809 -2.52825 0.31984
magnitude: 0.69395 au
magnitude: 1.76389 debye
