program: Orca
programVersion: 4.2.1
elementType: Cl Cl Cl S N N N N C C C C C C C C C C C C C C C C C H H H H H H H H H H H H H
charge: 0
multiplicity: 1
keywords: wb97x-d3
keywords: def2-TZVPP
keywords: def2/J RIJCOSX GRIDX6 NOFINALGRIDX
keywords: grid4 nofinalgrid
keywords: scfconv7
keywords: smallprint printgap noloewdin
keywords: NOSOSCF
formula: C17H13Cl3N4S
InChI: InChI=1S/C17H13Cl3N4S/c18-13-3-1-12(2-4-13)9-25-17(8-24-11-21-10-22-24)23-16-6-5-14(19)7-15(16)20/h1-7,10-11H,8-9H2
38 atoms
Cl -2.120274 1.14611 3.099584
Cl 3.760197 0.512003 -3.856277
Cl -3.055463 4.822631 -0.6982
S  0.796882 -2.263668 1.782944
N  -1.716904 -2.727524 0.272862
N  0.055007 0.188712 1.217838
N  -1.353407 -2.70816 -1.01054
N  -1.617775 -4.819808 -0.293468
C  -1.732667 -1.520407 1.052768
C  2.374771 -1.372573 1.682144
C  -0.331822 -1.009725 1.310336
C  2.70758 -0.908462 0.294742
C  2.995633 0.429982 0.05457
C  2.749618 -1.801468 -0.77138
C  -0.746633 1.230827 0.772777
C  3.324473 0.876304 -1.217064
C  3.074105 -1.374158 -2.048997
C  -1.854185 -3.987112 0.688325
C  -1.753043 1.809572 1.546253
C  -0.472646 1.802071 -0.470229
C  3.357329 -0.033473 -2.260439
C  -2.466194 2.914056 1.105595
C  -1.1802 2.894355 -0.934477
C  -2.172844 3.444997 -0.137707
C  -1.317763 -3.980608 -1.302301
H  -2.225882 -1.733533 2.001724
H  -2.326367 -0.768459 0.535002
H  3.10542 -2.102105 2.038226
H  2.371248 -0.545677 2.390274
H  2.961965 1.143946 0.86698
H  2.520817 -2.847961 -0.613735
H  3.543077 1.921792 -1.385859
H  3.104415 -2.080562 -2.867175
H  -2.136477 -4.243841 1.697021
H  0.316853 1.375535 -1.074879
H  -3.239818 3.344674 1.726181
H  -0.951386 3.31204 -1.904803
H  -1.064709 -4.323171 -2.293043
elementType: Cl S N C H
totalener: -2653.53042620 hartree
nucrepener: 2727.71575996 hartree
electener: -5381.24618616 hartree
oneelecener: -9071.02454412 hartree
twoeener: 3689.77835796 hartree
cpcmener: -0.02938121 hartree
kineticenergy: 2647.25382192 hartree
xcener: -168.237837806615 hartree
chargesum: -0.0000000
charge: -0.080303 -0.105582 -0.092412 -0.085610 0.073763 -0.275394 -0.333958 -0.411011 -0.074685 -0.035863 0.162911 0.095898 -0.225126 -0.210960 0.163077 -0.149316 -0.137476 0.068894 -0.036676 -0.197008 0.092264 -0.093771 -0.138399 0.074188 0.068460 0.143827 0.148771 0.151773 0.115010 0.132826 0.129388 0.146108 0.145026 0.186235 0.147527 0.127959 0.146817 0.162829
qa: -0.0803 -0.1056 -0.0924 -0.0856 0.0738 -0.2754 -0.3340 -0.4110 -0.0747 -0.0359 0.1629 0.0959 -0.2251 -0.2110 0.1631 -0.1493 -0.1375 0.0689 -0.0367 -0.1970 0.0923 -0.0938 -0.1384 0.0742 0.0685 0.1438 0.1488 0.1518 0.1150 0.1328 0.1294 0.1461 0.1450 0.1862 0.1475 0.1280 0.1468 0.1628
va: 1.2472 1.1994 1.2102 2.3920 3.4143 3.0070 2.8787 3.0209 3.8648 3.8236 3.9340 3.5222 3.9410 4.0036 3.7388 3.9255 3.9702 4.0481 3.9719 4.0014 3.8108 4.0110 4.0240 3.8415 4.0447 1.0008 1.0010 0.9981 1.0331 1.0120 1.0159 1.0036 1.0039 0.9894 1.0020 1.0173 1.0044 0.9950
dispcorr: -0.023058112 hartree
energy: -2653.553484313899
dipole: 7.55539 -7.51723 0.03815 -15.79964 15.79106 -0.00858 2.91555 -1.33744 1.57811
magnitude: 1.57859 au
magnitude: 4.01246 debye
