program: Orca
programVersion: 4.2.1
elementType: Cl Cl Cl S N N N N C C C C C C C C C C C C C C C C C H H H H H H H H H H H H H
charge: 0
multiplicity: 1
keywords: wb97x-d3
keywords: def2-TZVPP
keywords: def2/J RIJCOSX GRIDX6 NOFINALGRIDX
keywords: grid4 nofinalgrid
keywords: scfconv7
keywords: smallprint printgap noloewdin
keywords: NOSOSCF
formula: C17H13Cl3N4S
InChI: InChI=1S/C17H13Cl3N4S/c18-13-3-1-12(2-4-13)9-25-17(8-24-11-21-10-22-24)23-16-6-5-14(19)7-15(16)20/h1-7,10-11H,8-9H2
38 atoms
Cl -1.313664 1.695133 1.753205
Cl 8.121477 0.136785 0.030415
Cl -5.923402 2.512364 -0.870386
S  1.482019 -1.431149 0.215916
N  -2.349549 -1.960226 0.927977
N  -0.635916 -0.093762 -0.570918
N  -2.682153 -2.706601 -0.126524
N  -4.51447 -1.926176 0.897957
C  -0.973876 -1.749215 1.274188
C  2.198655 -0.189654 -0.907501
C  -0.208703 -0.980216 0.216921
C  3.676353 -0.124227 -0.670394
C  4.189605 0.690642 0.33485
C  4.558817 -0.873784 -1.440436
C  -1.912701 0.449631 -0.573716
C  5.553644 0.775594 0.557923
C  5.927768 -0.802855 -1.229163
C  -3.450709 -1.497614 1.527774
C  -2.338957 1.354297 0.40073
C  -2.769116 0.206515 -1.646895
C  6.413028 0.02657 -0.231519
C  -3.565202 1.993059 0.320052
C  -4.003087 0.821857 -1.738454
C  -4.391336 1.716582 -0.754012
C  -3.988948 -2.65584 -0.10747
H  -0.500442 -2.716277 1.451974
H  -0.929192 -1.199418 2.215357
H  1.716519 0.765416 -0.700353
H  1.967594 -0.466719 -1.935086
H  3.519564 1.278577 0.950282
H  4.181797 -1.517824 -2.225301
H  5.93851 1.422309 1.334464
H  6.603226 -1.384961 -1.841105
H  -3.423705 -0.87169 2.406204
H  -2.452701 -0.478686 -2.421732
H  -3.867402 2.690268 1.089313
H  -4.650136 0.607655 -2.577711
H  -4.589977 -3.169269 -0.841651
elementType: Cl S N C H
totalener: -2653.54292307 hartree
nucrepener: 2631.51881078 hartree
electener: -5285.06173385 hartree
oneelecener: -8878.61157966 hartree
twoeener: 3593.54984581 hartree
cpcmener: -0.02641882 hartree
kineticenergy: 2647.21325778 hartree
xcener: -168.232762061180 hartree
chargesum: 0.0000000
charge: -0.081255 -0.096979 -0.093333 -0.056549 0.119206 -0.287185 -0.338467 -0.386010 -0.105352 -0.045372 0.160639 0.007792 -0.195541 -0.173264 0.217616 -0.133107 -0.140015 0.072533 -0.082806 -0.229785 0.086101 -0.079411 -0.106097 0.067393 0.058600 0.139708 0.148332 0.120425 0.123702 0.139000 0.142646 0.144869 0.144265 0.169162 0.137955 0.125655 0.144117 0.160811
qa: -0.0813 -0.0970 -0.0933 -0.0565 0.1192 -0.2872 -0.3385 -0.3860 -0.1054 -0.0454 0.1606 0.0078 -0.1955 -0.1733 0.2176 -0.1331 -0.1400 0.0725 -0.0828 -0.2298 0.0861 -0.0794 -0.1061 0.0674 0.0586 0.1397 0.1483 0.1204 0.1237 0.1390 0.1426 0.1449 0.1443 0.1692 0.1380 0.1257 0.1441 0.1608
va: 1.2455 1.2083 1.2105 2.4388 3.3331 2.9729 2.8460 3.0234 3.9108 3.8458 3.9647 3.6383 3.9957 3.9788 3.6877 3.9667 3.9691 4.0523 3.9694 3.9696 3.8443 3.9871 3.9652 3.8658 4.0561 1.0136 1.0007 1.0199 1.0146 1.0054 1.0038 1.0041 1.0045 0.9954 1.0195 1.0178 1.0023 0.9963
dispcorr: -0.022600252 hartree
energy: -2653.565523326504
dipole: 2.03365 -1.30564 0.72801 -10.54182 10.33142 -0.21040 -4.04906 4.36326 0.31420
magnitude: 0.82036 au
magnitude: 2.08518 debye
