program: Orca
programVersion: 4.2.1
elementType: Cl Cl Cl S N N N N C C C C C C C C C C C C C C C C C H H H H H H H H H H H H H
charge: 0
multiplicity: 1
keywords: wb97x-d3
keywords: def2-TZVPP
keywords: def2/J RIJCOSX GRIDX6 NOFINALGRIDX
keywords: grid4 nofinalgrid
keywords: scfconv7
keywords: smallprint printgap noloewdin
keywords: NOSOSCF
formula: C17H13Cl3N4S
InChI: InChI=1S/C17H13Cl3N4S/c18-13-3-1-12(2-4-13)9-25-17(8-24-11-21-10-22-24)23-16-6-5-14(19)7-15(16)20/h1-7,10-11H,8-9H2
38 atoms
Cl -0.251114 1.972346 1.666449
Cl 4.172424 1.671059 1.658303
Cl -0.610866 4.401557 -3.101961
S  -0.988436 -2.353166 -1.029631
N  -1.729065 -3.44562 1.624532
N  -1.845738 -0.151179 0.431044
N  -0.55243 -3.335533 2.242074
N  -1.067878 -5.48864 1.911082
C  -2.474311 -2.278488 1.239995
C  0.296932 -1.340351 -1.811022
C  -1.75331 -1.39433 0.242606
C  1.231294 -0.603275 -0.894946
C  1.800892 0.58186 -1.350754
C  1.586057 -1.072661 0.364254
C  -1.508086 0.863267 -0.44313
C  2.709261 1.284823 -0.577044
C  2.494734 -0.381306 1.150199
C  -2.023415 -4.732849 1.429006
C  -0.807156 1.972645 0.037981
C  -1.957555 0.900245 -1.762735
C  3.049276 0.793375 0.672436
C  -0.524802 3.058834 -0.769478
C  -1.6918 1.981737 -2.584991
C  -0.967978 3.050284 -2.082115
C  -0.19371 -4.584257 2.394058
H  -2.705016 -1.676945 2.117748
H  -3.41949 -2.611465 0.806872
H  -0.144341 -0.66424 -2.54098
H  0.851742 -2.090714 -2.382132
H  1.530169 0.972515 -2.324217
H  1.145609 -1.979682 0.758985
H  3.136146 2.208218 -0.94412
H  2.755354 -0.755844 2.130836
H  -2.928955 -5.060941 0.943013
H  -2.540892 0.073876 -2.149366
H  0.039851 3.894341 -0.379828
H  -2.049913 1.984148 -3.605245
H  0.733785 -4.854924 2.874427
elementType: Cl S N C H
totalener: -2653.53672426 hartree
nucrepener: 2826.65562761 hartree
electener: -5480.19235187 hartree
oneelecener: -9269.17771934 hartree
twoeener: 3788.98536747 hartree
cpcmener: -0.02874021 hartree
kineticenergy: 2647.23185038 hartree
xcener: -168.240210116312 hartree
chargesum: 0.0000000
charge: -0.072885 -0.103268 -0.090724 -0.091941 0.082248 -0.257178 -0.357064 -0.410223 -0.030795 -0.068347 0.098642 0.020878 -0.187822 -0.121926 0.168210 -0.166790 -0.189288 0.078892 0.033237 -0.239371 0.131779 -0.118106 -0.128562 0.072697 0.085748 0.121390 0.139490 0.133486 0.157420 0.138551 0.130030 0.136395 0.133366 0.178810 0.164781 0.118975 0.146658 0.162609
qa: -0.0729 -0.1033 -0.0907 -0.0919 0.0822 -0.2572 -0.3571 -0.4102 -0.0308 -0.0683 0.0986 0.0209 -0.1878 -0.1219 0.1682 -0.1668 -0.1893 0.0789 0.0332 -0.2394 0.1318 -0.1181 -0.1286 0.0727 0.0857 0.1214 0.1395 0.1335 0.1574 0.1386 0.1300 0.1364 0.1334 0.1788 0.1648 0.1190 0.1467 0.1626
va: 1.2492 1.2009 1.2130 2.4033 3.3821 3.0317 2.8348 3.0256 3.7941 3.8962 4.0572 3.6079 3.9221 3.8828 3.7561 3.9931 4.0578 4.0447 3.9116 3.9953 3.7697 3.9887 3.9918 3.8263 4.0131 1.0230 0.9958 1.0071 0.9911 0.9948 1.0382 1.0090 1.0108 0.9899 0.9989 1.0251 1.0042 0.9938
dispcorr: -0.027079227 hartree
energy: -2653.563803482756
dipole: -7.82627 6.26409 -1.56218 -20.75303 20.21206 -0.54096 -4.64127 2.77243 -1.86884
magnitude: 2.49512 au
magnitude: 6.34210 debye
