program: Orca
programVersion: 4.2.1
elementType: Cl Cl Cl S N N N N C C C C C C C C C C C C C C C C C H H H H H H H H H H H H H
charge: 0
multiplicity: 1
keywords: wb97x-d3
keywords: def2-TZVPP
keywords: def2/J RIJCOSX GRIDX6 NOFINALGRIDX
keywords: grid4 nofinalgrid
keywords: scfconv7
keywords: smallprint printgap noloewdin
keywords: NOSOSCF
formula: C17H13Cl3N4S
InChI: InChI=1S/C17H13Cl3N4S/c18-13-3-1-12(2-4-13)9-25-17(8-24-11-21-10-22-24)23-16-6-5-14(19)7-15(16)20/h1-7,10-11H,8-9H2
38 atoms
Cl -0.756809 0.043675 3.229962
Cl 3.126227 2.890822 -3.261641
Cl 0.237308 4.434275 0.29233
S  1.047211 -2.725215 0.522577
N  -2.807403 -3.434643 0.180165
N  -1.305257 -1.243076 0.602413
N  -3.109701 -3.466126 -1.119058
N  -4.897965 -2.87654 0.092855
C  -1.460414 -3.618175 0.626742
C  2.015394 -1.256388 0.948623
C  -0.667919 -2.32226 0.575934
C  2.265255 -0.249537 -0.139631
C  2.183438 -0.554927 -1.492491
C  2.64418 1.036303 0.231627
C  -0.853561 0.061493 0.535705
C  2.454466 0.402603 -2.457409
C  2.920719 2.004989 -0.719285
C  -3.875344 -3.064556 0.88918
C  -0.636324 0.816017 1.686772
C  -0.754466 0.707464 -0.696255
C  2.814885 1.679539 -2.061122
C  -0.304736 2.159579 1.625242
C  -0.428241 2.047316 -0.779181
C  -0.204683 2.764084 0.385258
C  -4.373705 -3.134045 -1.122339
H  -0.994188 -4.393608 0.018469
H  -1.467647 -3.980529 1.655496
H  2.966843 -1.694264 1.264751
H  1.600269 -0.792905 1.842123
H  1.88885 -1.545748 -1.814276
H  2.72026 1.297068 1.280128
H  2.375563 0.150638 -3.506342
H  3.200601 3.003331 -0.412248
H  -3.861151 -2.959168 1.962558
H  -0.94113 0.143826 -1.600371
H  -0.125171 2.717729 2.533685
H  -0.343978 2.522556 -1.746364
H  -4.944865 -3.079209 -2.036141
elementType: Cl S N C H
totalener: -2653.53753017 hartree
nucrepener: 2807.92626064 hartree
electener: -5461.46379081 hartree
oneelecener: -9231.14558051 hartree
twoeener: 3769.68178970 hartree
cpcmener: -0.02749724 hartree
kineticenergy: 2647.23027381 hartree
xcener: -168.241297291873 hartree
chargesum: 0.0000000
charge: -0.083921 -0.102077 -0.096919 -0.083605 0.101929 -0.271319 -0.350431 -0.413123 -0.042623 -0.041271 0.147324 0.062758 -0.217068 -0.193780 0.175896 -0.122567 -0.158075 0.074393 -0.031269 -0.220357 0.098636 -0.108187 -0.103456 0.085754 0.066324 0.134656 0.142046 0.160112 0.125013 0.126020 0.136722 0.141918 0.130655 0.169769 0.136153 0.122923 0.139734 0.161313
qa: -0.0839 -0.1021 -0.0969 -0.0836 0.1019 -0.2713 -0.3504 -0.4131 -0.0426 -0.0413 0.1473 0.0628 -0.2171 -0.1938 0.1759 -0.1226 -0.1581 0.0744 -0.0313 -0.2204 0.0986 -0.1082 -0.1035 0.0858 0.0663 0.1347 0.1420 0.1601 0.1250 0.1260 0.1367 0.1419 0.1307 0.1698 0.1362 0.1229 0.1397 0.1613
va: 1.2385 1.2028 1.2079 2.3990 3.3837 3.0119 2.8703 3.0241 3.8125 3.8299 3.9851 3.5764 3.9602 3.9298 3.6915 3.9841 3.9281 4.0704 3.9211 3.9864 3.7924 3.9929 3.8914 3.8023 4.0532 1.0144 1.0015 0.9932 1.0334 1.0293 1.0009 1.0053 1.0188 0.9960 1.0139 1.0205 1.0015 0.9946
dispcorr: -0.027119762 hartree
energy: -2653.564649927785
dipole: -1.71364 3.53788 1.82424 -18.04100 16.86909 -1.17191 -0.85951 2.00671 1.14720
magnitude: 2.45301 au
magnitude: 6.23506 debye
