program: Gaussian 09
title: 000030352
version: EM64L-G09RevD.01
frameworkgroup: C1[X(C18H22N3O)]
method: RPBEPBE
basis: SDD
operation: Freq
keyword: #p
keyword: freq=noraman
keyword: PBEPBE/SDD
title: #p freq=noraman PBEPBE/SDD
converged: YES YES NO NO
title: Mulliken charges:
elementType: O N N N C C C C C C C C C C C C C C C C C C H H H H H H H H H H H H H H H H H H H H H H
charge: -0.287494 -0.155030 -0.423944 -0.082264 -0.417731 0.277433 0.380807 0.260304 -0.351937 -0.413882 -0.348022 -0.340276 -0.203072 -0.190874 -0.611146 -0.614194 0.384023 -0.330176 -0.373328 -0.225136 -0.191037 -0.236671 0.258329 0.285988 0.190827 0.239431 0.366551 0.239193 0.247999 0.268119 0.266858 0.260390 0.262634 0.228486 0.209831 0.244677 0.251372 0.207789 0.219363 0.245826 0.259231 0.242750 0.248558 0.249444
chargesum: 1.00000
title: Mulliken charges with hydrogens summed into heavy atoms:
elementType: O N N N C C C C C C C C C C C C C C C C C C
charge: -0.287494 -0.155030 -0.057393 -0.082264 0.126587 0.277433 0.380807 0.260304 0.078320 0.073311 -0.079903 -0.073418 0.057318 0.071760 0.071848 0.064330 0.384023 -0.084350 -0.114098 0.017614 0.057522 0.012773
polarizability: 3.11171296e+02 2.43622049e+01 2.05625052e+02 -1.16249079e+01 1.60024637e+01 1.61863535e+02
1716.lowfreq: -8.3989 0.0000 0.0002 0.0005 1.4864 4.8255 14.7531 23.9110 33.1662
frequency: 14.6033 23.6250 33.1417 35.4274 43.8157 61.8512 89.8361 93.4904 143.0870 162.9391 183.1917 193.2251 202.8299 224.8913 226.3860 268.2500 273.3860 297.8253 324.8565 364.9310 405.9799 408.5697 418.7975 436.3072 452.0083 495.4516 500.3693 527.6791 567.0847 569.9147 602.2150 608.5242 666.2533 673.4812 690.1612 715.5695 734.8882 755.3412 759.5929 768.1660 789.4753 802.1641 820.1050 822.7839 861.5345 866.1634 899.5125 914.8146 958.3968 969.6755 972.0637 986.2433 996.1653 998.7660 1002.5298 1012.0767 1015.6971 1023.1995 1038.7981 1052.9626 1063.7201 1086.7204 1089.4368 1110.1676 1133.3855 1148.1659 1166.8273 1177.2596 1179.6585 1183.7484 1192.9260 1196.6383 1236.7289 1244.4305 1266.4458 1278.9502 1290.7437 1306.7427 1316.6392 1327.2718 1339.9967 1367.1390 1369.9203 1389.3651 1422.5019 1427.5162 1443.6825 1445.7278 1449.2971 1461.6441 1465.6409 1468.5771 1474.1561 1476.6001 1478.1760 1482.6720 1489.7490 1490.6607 1514.3843 1537.7114 1595.1883 1608.5333 1615.7098 1630.9558 2838.8049 2888.5550 2903.1323 2956.9588 3009.5055 3032.4656 3038.4426 3040.1910 3058.5066 3089.1265 3093.9589 3124.7303 3138.9862 3148.1747 3157.8659 3159.3652 3166.7092 3168.3960 3176.9458 3181.5271 3188.6660 3577.9849
redmass: 4.7350 3.7539 3.1419 3.5940 4.8652 3.6969 3.7505 2.9476 4.5108 3.2467 3.8188 3.2033 1.0957 1.6343 2.5573 3.1410 2.3317 4.4065 3.2547 3.2847 3.3657 2.8839 2.8909 2.6320 3.7039 3.0240 6.2565 3.3287 6.2148 3.6594 6.2453 6.4644 1.8314 1.9859 2.2197 5.8603 4.7493 4.5339 1.5564 1.3197 1.3242 4.8762 1.2814 3.9175 4.1910 1.4174 1.3936 3.9775 1.3618 1.4679 5.5267 6.3689 1.5381 1.4117 1.3381 2.1154 3.7228 2.1052 1.6697 2.0840 1.7343 1.5291 1.2894 2.4070 1.4484 1.8645 1.8340 1.2882 1.3041 1.2922 1.4341 1.2601 2.1078 1.9808 1.5064 2.3695 1.5075 1.6609 1.3204 1.6487 1.5294 1.6088 1.3171 4.8783 5.0902 1.1413 2.3744 2.3975 1.1472 1.0974 1.9382 1.1737 1.4044 1.1064 1.3210 1.1566 1.2915 1.0974 3.6232 4.2891 6.1722 6.6817 7.0115 7.0753 1.0706 1.0539 1.0532 1.0569 1.1049 1.0780 1.0804 1.0870 1.0598 1.1001 1.1007 1.1066 1.0866 1.0877 1.0928 1.0878 1.0911 1.0960 1.0968 1.1016 1.1008 1.0827
irintensity: 0.0466 0.9574 0.0629 0.4485 0.2612 0.5188 2.2847 10.0594 3.6691 4.0152 2.9136 7.0352 0.3363 1.9282 0.5214 3.1790 0.5914 5.4690 11.3787 7.1436 0.2540 0.1579 7.1668 6.9291 0.3521 9.9597 1.8421 4.5492 7.8438 4.5949 2.3172 0.2010 39.2272 33.9617 27.6406 8.6143 4.0844 1.2616 92.3871 133.5611 1.6207 55.5393 1.8845 4.9422 12.1628 0.5492 4.5351 6.5493 2.1092 6.4568 55.3904 0.4223 2.0931 2.6478 0.0408 2.9300 2.0708 18.8750 27.1818 73.5479 21.6198 14.3409 9.5587 1.8093 17.2744 7.2730 173.5244 10.6929 52.7893 15.1360 69.3713 3.5595 15.5259 8.9965 1.0884 32.7037 3.6965 0.2410 1.6267 2.3314 3.5875 40.2184 9.9687 22.4347 4.6909 5.0466 12.5452 14.5716 4.7217 5.1103 67.5006 21.6409 79.9499 18.9422 5.2193 16.3693 18.3123 15.2820 44.8330 2.4246 68.6752 24.5981 17.0228 5.0458 68.0098 71.3450 150.2452 36.6550 22.7265 35.2155 23.4287 22.3035 5.7468 16.3393 38.7154 1.6009 14.5777 0.7348 15.6610 0.2849 1.0766 9.7683 1.4884 5.1943 1.7157 149.1678
temp: 298.150 k
press: 1.00000 atm
elementType: 8 7 7 7 6 6 6 6 6 6 6 6 6 6 6 6 6 6 6 6 6 6 1 1 1 1 1 1 1 1 1 1 1 1 1 1 1 1 1 1 1 1 1 1
symmnumber: 1
zpe: 965399.4 jmol-1
zpe.correction: 0.367701 hartree
zpe.thermalcorrener: 0.388408 hartree
zpe.thermalcorrenthalpy: 0.389352 hartree
zpe.thermalcorrgfe: 0.315061 hartree
zpe.sumelectzpe: -936.749816 hartree
zpe.sumelectthermal: -936.729109 hartree
zpe.sumelectthermalent: -936.728165 hartree
zpe.sumelectthermalfe: -936.802456 hartree
dipole: -5.1868 -2.2401 -2.9252
dipole: 6.3622
quadrupole: -67.4466 -98.5719 -118.0217
quadrupole: 9.7161 -2.9176 7.9015
quadrupole: 27.2335 -3.8918 -23.3416 9.7161 -2.9176 7.9015
hfenergy: -937.1175169 hartree
pointgroup: C01 [X(C18H22N3O1)]
dipole: -1.9651128 -0.9224572 -1.2461428 debye
polarizability: 308.0463412|31.1983967|206.6628614|-8.3811319|18.8338952|163.9506798 unknown
InChI: InChI=1S/C18H22N3O/c1-20(2)12-13-21-17-11-7-6-10-16(17)19-18(21)14-22-15-8-4-3-5-9-15/h3-11,19H,12-14H2,1-2H3
charge 1 multiplicity 1
44 atoms
O  1.59189 -0.900921 0.208927
N  -1.316383 -0.069144 0.042752
N  -1.393086 -1.968389 -1.103189
N  -0.506394 3.628969 0.251161
C  -0.827472 1.211802 0.612488
C  -2.642692 -0.55832 0.145867
C  -0.584372 -0.930509 -0.722024
C  -2.691288 -1.780555 -0.588001
C  -1.047311 2.411478 -0.357302
C  0.868698 -0.794514 -1.058508
C  -3.77725 -0.052722 0.812029
C  -3.870794 -2.543923 -0.690034
C  -4.957855 -0.814975 0.712043
C  -5.00411 -2.036342 -0.024457
C  -1.261644 4.863834 -0.056625
C  0.954397 3.789653 0.089901
C  3.012769 -0.728443 0.152559
C  3.732004 -0.494459 -1.040249
C  3.662667 -0.812864 1.403431
C  5.137524 -0.337725 -0.965366
C  5.062541 -0.654455 1.457591
C  5.804983 -0.415017 0.275337
H  -1.365863 1.40079 1.554312
H  0.238625 1.087167 0.857199
H  -0.586753 2.171468 -1.350907
H  -2.130908 2.542471 -0.531073
H  -1.078516 -2.76716 -1.655981
H  1.168674 -1.593426 -1.767053
H  1.063996 0.185029 -1.543458
H  -3.753095 0.880618 1.381028
H  -3.913232 -3.482314 -1.250011
H  -5.864449 -0.463102 1.213089
H  -5.944629 -2.593079 -0.071043
H  -2.329692 4.723907 0.184499
H  -1.179704 5.179232 -1.123731
H  -0.88232 5.68796 0.571517
H  1.299706 4.639968 0.701565
H  1.255149 3.98028 -0.968918
H  1.492737 2.892712 0.445444
H  3.241456 -0.438431 -2.017547
H  3.073828 -1.004298 2.305545
H  5.705274 -0.158016 -1.884165
H  5.573473 -0.720337 2.423522
H  6.891422 -0.294598 0.323336
