program: Orca
programVersion: 4.2.1
elementType: Cl Cl Cl S N N N N C C C C C C C C C C C C C C C C C H H H H H H H H H H H H H
charge: 0
multiplicity: 1
keywords: wb97x-d3
keywords: def2-TZVPP
keywords: def2/J RIJCOSX GRIDX6 NOFINALGRIDX
keywords: grid4 nofinalgrid
keywords: scfconv7
keywords: smallprint printgap noloewdin
keywords: NOSOSCF
formula: C17H13Cl3N4S
InChI: InChI=1S/C17H13Cl3N4S/c18-13-3-1-12(2-4-13)9-25-17(8-24-11-21-10-22-24)23-16-6-5-14(19)7-15(16)20/h1-7,10-11H,8-9H2
38 atoms
Cl -1.42116 -0.685746 3.329338
Cl 3.569902 2.180089 -3.534697
Cl -3.546227 3.652449 0.977737
S  1.692865 -2.991355 0.715527
N  -1.941261 -1.985202 -0.307406
N  0.411621 -0.721296 0.927582
N  -1.652407 -1.615314 -1.55609
N  -3.680286 -0.873113 -0.96127
C  -0.995097 -2.73219 0.470586
C  3.01934 -1.778303 0.959375
C  0.280111 -1.954553 0.722292
C  3.158555 -0.800031 -0.170905
C  3.335121 -1.229894 -1.481408
C  3.122349 0.566601 0.081701
C  -0.58341 0.240102 0.93232
C  3.463582 -0.321344 -2.520668
C  3.255977 1.490244 -0.943039
C  -3.150506 -1.532968 0.037162
C  -1.458867 0.425282 2.00254
C  -0.642205 1.156315 -0.118846
C  3.419797 1.035335 -2.24112
C  -2.368464 1.470354 2.029594
C  -1.552498 2.195422 -0.118923
C  -2.410076 2.345701 0.959637
C  -2.722799 -0.950916 -1.907697
H  -0.776633 -3.671711 -0.038501
H  -1.45222 -2.987536 1.427827
H  3.918325 -2.389497 1.065518
H  2.860968 -1.266959 1.908329
H  3.363424 -2.288396 -1.709932
H  2.976013 0.92395 1.092802
H  3.594917 -0.672627 -3.535209
H  3.219868 2.549318 -0.726607
H  -3.59224 -1.715277 1.004601
H  0.042147 1.039017 -0.94826
H  -3.036299 1.588336 2.871753
H  -1.583706 2.883461 -0.95262
H  -2.820066 -0.506366 -2.8858
elementType: Cl S N C H
totalener: -2653.54015728 hartree
nucrepener: 2799.63004826 hartree
electener: -5453.17020553 hartree
oneelecener: -9215.33773990 hartree
twoeener: 3762.16753437 hartree
cpcmener: -0.02537410 hartree
kineticenergy: 2647.22560687 hartree
xcener: -168.237937054089 hartree
chargesum: 0.0000000
charge: -0.083211 -0.104097 -0.094886 -0.074910 0.119562 -0.272475 -0.334510 -0.386058 -0.123443 -0.050002 0.185042 0.098889 -0.222962 -0.214036 0.222242 -0.128787 -0.141256 0.071471 -0.085993 -0.236894 0.082100 -0.074093 -0.112499 0.066238 0.058730 0.132607 0.151029 0.151673 0.117184 0.131570 0.130469 0.144356 0.142545 0.168338 0.138414 0.123510 0.143163 0.160980
qa: -0.0832 -0.1041 -0.0949 -0.0749 0.1196 -0.2725 -0.3345 -0.3861 -0.1234 -0.0500 0.1850 0.0989 -0.2230 -0.2140 0.2222 -0.1288 -0.1413 0.0715 -0.0860 -0.2369 0.0821 -0.0741 -0.1125 0.0662 0.0587 0.1326 0.1510 0.1517 0.1172 0.1316 0.1305 0.1444 0.1425 0.1683 0.1384 0.1235 0.1432 0.1610
va: 1.2442 1.2004 1.2086 2.3955 3.3365 3.0157 2.8506 3.0236 3.9244 3.8269 3.9294 3.5409 4.0186 3.9502 3.6708 3.9683 3.9372 4.0520 3.9459 3.9569 3.8256 3.9877 3.9849 3.8558 4.0530 1.0143 0.9978 0.9980 1.0315 1.0150 1.0118 1.0035 1.0049 0.9961 1.0117 1.0187 1.0038 0.9961
dispcorr: -0.025957520 hartree
energy: -2653.566114798346
dipole: 8.05845 -7.13158 0.92687 -13.01579 11.27348 -1.74231 -2.53680 3.70851 1.17171
magnitude: 2.29514 au
magnitude: 5.83378 debye
