program: Gaussian 09
title: 000030459
version: EM64L-G09RevD.01
frameworkgroup: C1[X(C24H31NO)]
method: RPBEPBE
basis: SDD
operation: Freq
keyword: #p
keyword: freq=noraman
keyword: PBEPBE/SDD
title: #p freq=noraman PBEPBE/SDD
converged: YES YES NO NO
title: Mulliken charges:
elementType: O N C C C C C C C C C C C C C C C C C C C C C C C C H H H H H H H H H H H H H H H H H H H H H H H H H H H H H H H
charge: -0.480526 -0.092408 -0.085623 -0.087198 -0.429015 -0.476299 -0.416081 -0.458450 -0.385290 -0.400812 -0.379668 -0.111324 0.036888 -0.768688 0.373312 0.383473 -0.397829 -0.417538 -0.370934 -0.398713 -0.224871 -0.261812 -0.248655 -0.223584 -0.244426 -0.244126 0.197557 0.194913 0.194896 0.209086 0.208342 0.205386 0.198881 0.195768 0.202808 0.209573 0.194174 0.183335 0.169174 0.206326 0.211626 0.225300 0.194702 0.243134 0.185341 0.259731 0.343540 0.284897 0.238042 0.231144 0.273237 0.222730 0.225516 0.222697 0.224678 0.225094 0.228567
chargesum: 0.00000
title: Mulliken charges with hydrogens summed into heavy atoms:
elementType: O N C C C C C C C C C C C C C C C C C C C C C C C C
charge: -0.136986 -0.092408 0.111933 0.107715 -0.025033 -0.062571 -0.021433 -0.046069 -0.007781 -0.025312 0.057258 0.083378 0.036888 -0.080482 0.373312 0.383473 -0.112932 -0.179496 -0.139789 -0.125476 -0.002141 -0.036296 -0.025958 0.001094 -0.019332 -0.015559
polarizability: 2.75713926e+02 -1.24394638e+01 2.61040732e+02 -4.09249810e-01 -1.14077219e+01 2.30036217e+02
1716.lowfreq: -8.7210 -5.1760 -0.0004 -0.0002 0.0003 3.5527 13.5378 27.6759 32.0045
frequency: 12.5627 27.6572 31.8871 37.4422 46.8211 52.1624 66.4200 80.3211 99.0401 146.2466 165.6386 186.7735 205.2080 213.2027 220.9502 250.9447 267.2475 282.6954 294.0536 301.9349 314.0364 320.7670 333.3281 351.4500 363.1983 377.1010 401.4272 407.7398 416.0039 432.2669 464.8085 483.2465 513.9646 527.4014 538.4474 615.8520 616.4317 621.0107 629.3898 672.6575 702.6982 711.1490 715.2638 746.2073 756.8123 761.3386 773.6541 780.0263 807.2370 839.4932 853.1770 858.9169 861.2556 866.6510 876.1564 886.7331 902.6873 921.5437 922.1660 928.6551 944.2256 963.7333 964.7505 974.1062 978.6608 979.4075 984.5653 989.5695 990.6567 998.2996 1000.5859 1006.2308 1028.1576 1029.9202 1055.4082 1073.0500 1081.4239 1083.2126 1085.3807 1107.7974 1114.2913 1117.6646 1129.3047 1144.7080 1147.9733 1162.4728 1170.4493 1171.2372 1173.3200 1189.1516 1192.5682 1195.4555 1202.5844 1211.1927 1230.9195 1241.2743 1248.5533 1271.6214 1284.7251 1301.6948 1303.5585 1309.3769 1312.0672 1317.1735 1319.5557 1324.1347 1325.2572 1329.0007 1341.5721 1348.0793 1353.9919 1364.3025 1367.2318 1375.6160 1377.9895 1380.7402 1391.7767 1431.6225 1435.0461 1454.4528 1458.7468 1463.7252 1468.7627 1469.8163 1471.7773 1477.8745 1480.1233 1481.0489 1488.7599 1494.1433 1587.7938 1590.8668 1607.8101 1611.7903 2818.5782 2830.3264 2908.4888 2957.4960 2963.4319 2967.5045 2967.7967 2979.0780 2984.5690 2984.7638 2995.1240 3002.1470 3013.7806 3016.9219 3024.8001 3034.5534 3040.7761 3053.4469 3060.7813 3094.1734 3118.7653 3120.6573 3127.2246 3128.8719 3140.1373 3142.1265 3152.6975 3157.9164 3164.6180 3179.7542 3564.0456
redmass: 3.5285 3.9343 3.9812 3.9740 3.2072 2.5021 3.6462 4.0475 2.9145 3.7243 4.2488 3.2139 1.4238 2.2197 1.9823 3.9616 2.2597 3.6431 4.5047 1.3432 2.7615 2.3953 2.7378 2.9002 3.0888 1.9946 2.8420 2.8010 2.7650 3.8387 3.8963 3.6084 3.4017 3.2423 4.0914 6.4097 6.4133 4.6849 4.5466 4.6436 1.8293 1.7745 2.9792 3.5064 1.7819 1.4796 2.0987 2.3751 1.5990 3.3184 1.2607 2.4297 1.3262 3.0308 2.7725 2.1899 1.5477 1.7837 1.8028 1.6398 2.2024 2.1226 2.2157 2.1347 1.7218 1.7454 1.4312 5.6111 5.0132 1.3227 1.3400 2.2302 2.2202 2.1695 2.1323 1.7746 1.5943 2.3577 1.6025 2.4411 2.0263 1.9305 1.8151 1.9139 2.1251 1.1028 1.4196 1.0583 1.4812 1.1511 1.2393 2.0402 1.3373 1.2951 1.2434 1.2590 1.2066 1.4584 1.5053 1.4010 1.4854 1.4971 1.6193 1.5357 1.3687 1.3330 1.4959 1.4764 1.3739 1.3653 1.4206 1.3654 1.3666 1.6231 3.0622 7.8836 1.3518 2.2105 2.2482 1.0771 1.0740 1.0679 1.0747 1.0888 1.0866 2.1831 2.2096 1.0902 1.0875 1.0497 6.0838 6.2672 6.0629 6.0522 1.0717 1.0708 1.0684 1.0707 1.0772 1.0549 1.0477 1.0736 1.0664 1.0759 1.0743 1.0851 1.1005 1.0855 1.0990 1.0912 1.1026 1.1016 1.0919 1.1000 1.0846 1.0844 1.0881 1.0876 1.0939 1.0928 1.0951 1.0992 1.1006 1.0947 1.0652
irintensity: 0.1153 0.0595 0.0480 0.0379 0.5444 0.0268 0.0903 0.1244 0.4149 1.2302 0.5763 4.9359 0.1346 0.4464 0.6288 0.1817 4.4720 4.0333 1.5742 149.9089 4.7955 7.5469 2.9861 9.3328 34.8246 0.0500 0.4718 5.0308 0.3048 6.8740 1.3969 1.9294 0.2820 3.0923 2.2353 0.0315 0.0509 20.2138 21.2534 4.4468 46.2442 59.8661 8.7995 3.8170 47.4536 1.8466 42.4208 4.0554 13.3885 11.6633 0.0633 0.3330 0.2131 9.8450 16.1607 0.7531 6.4803 11.3591 9.7028 3.4616 23.0138 3.3098 0.6670 48.2182 12.9026 1.3931 0.4361 0.9664 0.8428 0.5955 0.1806 4.7192 12.0065 3.0822 7.3785 29.4604 1.0042 16.6484 3.1396 10.1951 4.2485 9.2401 40.8954 35.8895 15.4828 1.8271 0.4853 0.3977 0.9297 4.1778 0.9511 7.1925 5.7971 7.2098 0.9730 3.7055 1.3710 10.9282 1.5622 4.9692 8.5925 2.6399 2.1500 1.7873 2.7632 14.5864 8.5008 3.3521 3.6287 7.7043 1.8928 1.8428 2.8801 13.5518 3.4709 2.1744 10.5748 3.0191 22.7254 1.3581 1.7885 4.0035 3.0435 16.7308 14.7243 26.3925 11.8388 24.5353 6.9816 4.2996 0.8515 0.8742 11.0277 3.7901 66.9851 122.9285 69.1896 0.1562 3.3027 9.8690 18.1441 121.8009 92.9014 17.1971 107.9360 69.8215 11.7280 30.2560 3.7879 28.2074 63.3981 103.2532 30.7610 23.0657 3.5731 3.0492 4.6900 5.7345 32.3783 34.5943 21.6363 29.7705 21.7036 6.6368 5.5110
temp: 298.150 k
press: 1.00000 atm
elementType: 8 7 6 6 6 6 6 6 6 6 6 6 6 6 6 6 6 6 6 6 6 6 6 6 6 6 1 1 1 1 1 1 1 1 1 1 1 1 1 1 1 1 1 1 1 1 1 1 1 1 1 1 1 1 1 1 1
symmnumber: 1
zpe: 1292522.0 jmol-1
zpe.correction: 0.492296 hartree
zpe.thermalcorrener: 0.516360 hartree
zpe.thermalcorrenthalpy: 0.517304 hartree
zpe.thermalcorrgfe: 0.436746 hartree
zpe.sumelectzpe: -1061.159654 hartree
zpe.sumelectthermal: -1061.135590 hartree
zpe.sumelectthermalent: -1061.134646 hartree
zpe.sumelectthermalfe: -1061.215204 hartree
dipole: -0.5173 -0.7519 0.6143
dipole: 1.1001
quadrupole: -153.8229 -152.9781 -149.4022
quadrupole: -4.7031 0.5459 -0.4744
quadrupole: -1.7552 -0.9104 2.6655 -4.7031 0.5459 -0.4744
hfenergy: -1061.6519493 hartree
pointgroup: C01 [X(C24H31N1O1)]
dipole: 0.2189459 -0.28992 -0.235241 debye
polarizability: 274.5784608|12.930172|262.5286657|-0.6885635|11.0136025|229.6837483 unknown
InChI: InChI=1S/C24H31NO/c1-19(16-25-17-20-12-13-21(18-25)15-14-20)24(26,22-8-4-2-5-9-22)23-10-6-3-7-11-23/h2-11,19-21,26H,12-18H2,1H3
charge 0 multiplicity 1
57 atoms
O  -1.733966 -0.111485 2.160017
N  2.321235 -0.028398 0.457927
C  3.930599 -0.229513 -1.510344
C  4.787493 -0.073776 1.110957
C  4.234615 -1.622514 -0.89713
C  5.156639 0.703155 -1.337862
C  4.812747 -1.521748 0.554844
C  5.554487 0.886813 0.159145
C  2.616464 0.381127 -0.933824
C  3.342893 0.400242 1.440021
C  0.940476 0.322556 0.879234
C  -0.115501 -0.697305 0.367692
C  -1.57761 -0.208404 0.686995
C  0.187114 -2.099222 0.944942
C  -1.822026 1.216999 0.145622
C  -2.67398 -1.150647 0.127781
C  -2.013744 2.311679 1.022561
C  -2.492787 -1.948622 -1.030671
C  -1.849754 1.445407 -1.253467
C  -3.940731 -1.169452 0.768414
C  -2.223441 3.611891 0.508803
C  -3.544831 -2.748964 -1.530253
C  -2.051575 2.744924 -1.766595
C  -4.992524 -1.969045 0.27204
C  -2.239185 3.83645 -0.886519
C  -4.799726 -2.764574 -0.88123
H  3.766488 -0.356936 -2.600615
H  5.328362 -0.064351 2.080465
H  4.958014 -2.145786 -1.553719
H  3.306163 -2.222062 -0.890334
H  4.94484 1.683302 -1.807486
H  6.0036 0.263789 -1.901233
H  4.242996 -2.1842 1.233211
H  5.86276 -1.876682 0.567029
H  6.640865 0.706554 0.277863
H  5.376877 1.930013 0.485874
H  1.767322 0.043752 -1.557888
H  2.657439 1.498259 -1.035706
H  3.360853 1.515783 1.568195
H  3.044554 -0.028369 2.416711
H  0.900895 0.327306 1.984726
H  0.664959 1.350202 0.547612
H  -0.026949 -0.747121 -0.73643
H  -0.498044 -2.87507 0.562856
H  0.132402 -2.098894 2.052486
H  1.22406 -2.370274 0.68214
H  -1.659169 -1.029234 2.525244
H  -1.996812 2.130119 2.10007
H  -1.528422 -1.960229 -1.55025
H  -1.734228 0.606316 -1.949385
H  -4.091083 -0.541952 1.65299
H  -2.372309 4.449661 1.199959
H  -3.382204 -3.361039 -2.424782
H  -2.071769 2.903938 -2.850861
H  -5.963573 -1.967296 0.780432
H  -2.400775 4.844981 -1.283754
H  -5.615194 -3.385458 -1.268814
