program: Orca
programVersion: 4.2.1
elementType: Cl Cl Cl S N N N N C C C C C C C C C C C C C C C C C H H H H H H H H H H H H H
charge: 0
multiplicity: 1
keywords: wb97x-d3
keywords: def2-TZVPP
keywords: def2/J RIJCOSX GRIDX6 NOFINALGRIDX
keywords: grid4 nofinalgrid
keywords: scfconv7
keywords: smallprint printgap noloewdin
keywords: NOSOSCF
formula: C17H13Cl3N4S
InChI: InChI=1S/C17H13Cl3N4S/c18-13-3-1-12(2-4-13)9-25-17(8-24-11-21-10-22-24)23-16-6-5-14(19)7-15(16)20/h1-7,10-11H,8-9H2
38 atoms
Cl 0.471693 0.585233 1.409204
Cl 4.225793 2.942547 0.716346
Cl -3.545904 3.579374 -0.503736
S  1.365929 -3.286916 -0.375504
N  -2.20155 -2.147169 0.910243
N  -0.11576 -1.201382 -0.932747
N  -2.686123 -1.17304 1.68348
N  -4.253162 -1.899157 0.258491
C  -0.839408 -2.593489 1.016649
C  2.423799 -2.340416 -1.511942
C  0.018809 -2.186917 -0.161556
C  2.883062 -1.02675 -0.953603
C  2.540222 0.162567 -1.585891
C  3.657986 -0.968504 0.200146
C  -0.978433 -0.131359 -0.760745
C  2.953746 1.386758 -1.084719
C  4.078021 0.246077 0.71789
C  -3.145406 -2.569277 0.062958
C  -0.779576 0.819633 0.244273
C  -1.989931 0.108162 -1.689654
C  3.716473 1.416402 0.069642
C  -1.55983 1.960781 0.326976
C  -2.792119 1.231212 -1.610439
C  -2.566096 2.15417 -0.6019
C  -3.917638 -1.059366 1.260173
H  -0.826317 -3.680097 1.122963
H  -0.415835 -2.181659 1.933309
H  1.898646 -2.211216 -2.457564
H  3.266705 -3.009969 -1.696769
H  1.933051 0.141382 -2.481379
H  3.937119 -1.87991 0.715086
H  2.670783 2.302189 -1.586251
H  4.678809 0.275674 1.616774
H  -2.979214 -3.353015 -0.6600
H  -2.145994 -0.605114 -2.488224
H  -1.382257 2.683019 1.111856
H  -3.576716 1.384957 -2.338075
H  -4.602132 -0.343869 1.688333
elementType: Cl S N C H
totalener: -2653.53898520 hartree
nucrepener: 2852.96295672 hartree
electener: -5506.50194193 hartree
oneelecener: -9322.29014418 hartree
twoeener: 3815.78820225 hartree
cpcmener: -0.02722838 hartree
kineticenergy: 2647.22882061 hartree
xcener: -168.239649669128 hartree
chargesum: 0.0000000
charge: -0.085972 -0.105582 -0.097384 -0.074165 0.125030 -0.266365 -0.337629 -0.396365 -0.093266 -0.055369 0.127776 0.082928 -0.196530 -0.230071 0.182010 -0.134036 -0.125191 0.053540 0.015169 -0.277088 0.081721 -0.104722 -0.079889 0.065451 0.075240 0.148456 0.145983 0.119723 0.152654 0.130086 0.131921 0.140464 0.141727 0.177306 0.139372 0.122683 0.142612 0.157774
qa: -0.0860 -0.1056 -0.0974 -0.0742 0.1250 -0.2664 -0.3376 -0.3964 -0.0933 -0.0554 0.1278 0.0829 -0.1965 -0.2301 0.1820 -0.1340 -0.1252 0.0535 0.0152 -0.2771 0.0817 -0.1047 -0.0799 0.0655 0.0752 0.1485 0.1460 0.1197 0.1527 0.1301 0.1319 0.1405 0.1417 0.1773 0.1394 0.1227 0.1426 0.1578
va: 1.2424 1.1985 1.2054 2.4009 3.3394 2.9540 2.8659 3.0189 3.8658 3.8305 4.0127 3.5064 3.9501 4.0265 3.6801 3.9385 3.9478 4.0609 3.9024 3.9915 3.8157 4.0282 3.9402 3.8544 4.0210 1.0025 1.0154 1.0300 0.9986 1.0134 1.0136 1.0050 1.0044 0.9926 1.0160 1.0210 1.0029 0.9973
dispcorr: -0.027400632 hartree
energy: -2653.566385836637
dipole: 0.63047 0.36861 0.99908 -19.41587 17.03833 -2.37754 -7.21458 6.37183 -0.84275
magnitude: 2.71313 au
magnitude: 6.89623 debye
