program: Orca
programVersion: 4.2.1
elementType: Cl Cl Cl S N N N N C C C C C C C C C C C C C C C C C H H H H H H H H H H H H H
charge: 0
multiplicity: 1
keywords: wb97x-d3
keywords: def2-TZVPP
keywords: def2/J RIJCOSX GRIDX6 NOFINALGRIDX
keywords: grid4 nofinalgrid
keywords: scfconv7
keywords: smallprint printgap noloewdin
keywords: NOSOSCF
formula: C17H13Cl3N4S
InChI: InChI=1S/C17H13Cl3N4S/c18-13-3-1-12(2-4-13)9-25-17(8-24-11-21-10-22-24)23-16-6-5-14(19)7-15(16)20/h1-7,10-11H,8-9H2
38 atoms
Cl -1.068184 1.283956 2.929027
Cl 5.072361 1.582089 -2.525463
Cl -3.054937 4.830329 -0.582058
S  0.507958 -2.736839 0.483547
N  -2.364363 -2.980132 -0.121614
N  -0.242778 -0.22532 0.5626
N  -2.898971 -3.016821 1.100133
N  -3.020137 -5.028876 0.124995
C  -1.788139 -1.763251 -0.627802
C  1.928621 -1.893956 1.238166
C  -0.55216 -1.37935 0.158258
C  2.700156 -1.028374 0.287952
C  3.338512 -1.576552 -0.820947
C  2.807763 0.339803 0.510366
C  -0.956307 0.92054 0.261947
C  4.067936 -0.782267 -1.691227
C  3.537959 1.149418 -0.346701
C  -2.438983 -4.18678 -0.692025
C  -1.370755 1.760171 1.29934
C  -1.188963 1.342526 -1.046914
C  4.160473 0.579269 -1.444653
C  -2.022713 2.954897 1.051513
C  -1.830117 2.539282 -1.316345
C  -2.248012 3.334302 -0.262434
C  -3.279436 -4.262963 1.20453
H  -2.534306 -0.97051 -0.584204
H  -1.527723 -1.919414 -1.675119
H  2.546427 -2.711969 1.614396
H  1.576581 -1.327559 2.099487
H  3.267832 -2.639632 -1.018187
H  2.309969 0.786406 1.36119
H  4.559605 -1.222505 -2.548327
H  3.612236 2.212034 -0.158587
H  -2.067595 -4.393218 -1.683862
H  -0.838277 0.734773 -1.871433
H  -2.345445 3.580397 1.872408
H  -1.994969 2.843703 -2.340624
H  -3.7656 -4.63698 2.092209
elementType: Cl S N C H
totalener: -2653.54429479 hartree
nucrepener: 2674.91054104 hartree
electener: -5328.45483582 hartree
oneelecener: -8965.32024404 hartree
twoeener: 3636.86540822 hartree
cpcmener: -0.02958995 hartree
kineticenergy: 2647.21941141 hartree
xcener: -168.231819197605 hartree
chargesum: 0.0000000
charge: -0.075315 -0.102127 -0.090533 -0.088826 0.068812 -0.285417 -0.333325 -0.407316 -0.091150 -0.037161 0.192891 0.050289 -0.221644 -0.176194 0.205330 -0.134205 -0.140973 0.082698 -0.085054 -0.264173 0.080263 -0.064343 -0.086743 0.055458 0.067992 0.148334 0.145012 0.153203 0.120221 0.134650 0.123371 0.143540 0.142816 0.180911 0.154185 0.125364 0.146414 0.162743
qa: -0.0753 -0.1021 -0.0905 -0.0888 0.0688 -0.2854 -0.3333 -0.4073 -0.0911 -0.0372 0.1929 0.0503 -0.2216 -0.1762 0.2053 -0.1342 -0.1410 0.0827 -0.0851 -0.2642 0.0803 -0.0643 -0.0867 0.0555 0.0680 0.1483 0.1450 0.1532 0.1202 0.1347 0.1234 0.1435 0.1428 0.1809 0.1542 0.1254 0.1464 0.1627
va: 1.2491 1.2035 1.2125 2.4014 3.3938 2.9169 2.8647 3.0268 3.8833 3.8215 3.9140 3.5420 4.0188 3.9429 3.5969 3.9670 3.9679 4.0346 4.0150 4.0327 3.8370 3.9651 3.9545 3.8750 4.0493 0.9960 0.9935 0.9983 1.0347 1.0120 1.0222 1.0043 1.0045 0.9894 1.0007 1.0210 1.0030 0.9945
dispcorr: -0.021408674 hartree
energy: -2653.565703460838
dipole: 1.45302 -1.10850 0.34452 -19.26721 18.96524 -0.30197 -2.48539 1.30514 -1.18025
magnitude: 1.26605 au
magnitude: 3.21803 debye
