program: Orca
programVersion: 4.2.1
elementType: Cl Cl Cl S N N N N C C C C C C C C C C C C C C C C C H H H H H H H H H H H H H
charge: 0
multiplicity: 1
keywords: wb97x-d3
keywords: def2-TZVPP
keywords: def2/J RIJCOSX GRIDX6 NOFINALGRIDX
keywords: grid4 nofinalgrid
keywords: scfconv7
keywords: smallprint printgap noloewdin
keywords: NOSOSCF
formula: C17H13Cl3N4S
InChI: InChI=1S/C17H13Cl3N4S/c18-13-3-1-12(2-4-13)9-25-17(8-24-11-21-10-22-24)23-16-6-5-14(19)7-15(16)20/h1-7,10-11H,8-9H2
38 atoms
Cl -1.618594 -0.627196 3.282545
Cl 4.446393 1.750884 -3.680361
Cl -4.157818 3.442307 0.874546
S  1.722534 -2.650493 0.923252
N  -1.940681 -1.997867 -0.308988
N  0.253037 -0.477698 0.918557
N  -1.656069 -1.602185 -1.550924
N  -3.769899 -1.085105 -1.022837
C  -0.944181 -2.632305 0.504267
C  2.945506 -1.345594 1.247522
C  0.241827 -1.728518 0.777537
C  3.309115 -0.568561 0.018539
C  4.004964 -1.181773 -1.020317
C  2.975358 0.775453 -0.105245
C  -0.842051 0.370916 0.890404
C  4.358072 -0.478025 -2.15944
C  3.323612 1.497012 -1.238462
C  -3.203287 -1.681534 -0.00545
C  -1.752756 0.462376 1.94456
C  -0.982919 1.273111 -0.164446
C  4.00971 0.860856 -2.259152
C  -2.770653 1.40191 1.951965
C  -1.999617 2.208499 -0.182809
C  -2.888042 2.267283 0.87937
C  -2.780309 -1.058286 -1.939126
H  -0.616005 -3.550624 0.015644
H  -1.399235 -2.922209 1.45237
H  3.809817 -1.882994 1.641673
H  2.568582 -0.702323 2.041662
H  4.279701 -2.227307 -0.946319
H  2.436915 1.272779 0.690169
H  4.900602 -0.968386 -2.95632
H  3.057593 2.542354 -1.319528
H  -3.655176 -1.908763 0.947395
H  -0.277101 1.229864 -0.983114
H  -3.462667 1.447989 2.781569
H  -2.090644 2.888653 -1.01838
H  -2.895389 -0.626664 -2.92094
elementType: Cl S N C H
totalener: -2653.54199710 hartree
nucrepener: 2757.46940165 hartree
electener: -5411.01139875 hartree
oneelecener: -9130.97070031 hartree
twoeener: 3719.95930156 hartree
cpcmener: -0.02637014 hartree
kineticenergy: 2647.21881830 hartree
xcener: -168.236285940441 hartree
chargesum: -0.0000000
charge: -0.082256 -0.100751 -0.093610 -0.071046 0.121425 -0.282436 -0.337483 -0.385791 -0.120081 -0.048119 0.172961 0.039288 -0.212362 -0.188069 0.235885 -0.130723 -0.138935 0.071270 -0.096433 -0.247003 0.081548 -0.070537 -0.100673 0.062628 0.058850 0.136284 0.151270 0.156692 0.121032 0.136570 0.137807 0.143547 0.143791 0.168949 0.136980 0.123736 0.143958 0.161837
qa: -0.0823 -0.1008 -0.0936 -0.0710 0.1214 -0.2824 -0.3375 -0.3858 -0.1201 -0.0481 0.1730 0.0393 -0.2124 -0.1881 0.2359 -0.1307 -0.1389 0.0713 -0.0964 -0.2470 0.0815 -0.0705 -0.1007 0.0626 0.0589 0.1363 0.1513 0.1567 0.1210 0.1366 0.1378 0.1435 0.1438 0.1689 0.1370 0.1237 0.1440 0.1618
va: 1.2462 1.2052 1.2102 2.4023 3.3312 2.9817 2.8469 3.0220 3.9128 3.7975 3.9480 3.5578 4.0178 3.9529 3.6452 3.9641 3.9529 4.0520 3.9669 3.9634 3.8424 3.9843 3.9658 3.8631 4.0537 1.0142 0.9989 0.9978 1.0341 1.0099 1.0106 1.0043 1.0050 0.9962 1.0181 1.0188 1.0031 0.9960
dispcorr: -0.024947156 hartree
energy: -2653.566944254630
dipole: 7.95602 -7.06929 0.88673 -11.24185 9.74929 -1.49256 -1.37617 2.67971 1.30354
magnitude: 2.17100 au
magnitude: 5.51823 debye
