program: Gaussian 09
title: 000030341
version: EM64L-G09RevD.01
frameworkgroup: C1[X(C13H20N2O3S)]
method: RPBEPBE
basis: SDD
operation: Freq
keyword: #p
keyword: freq=noraman
keyword: PBEPBE/SDD
title: #p freq=noraman PBEPBE/SDD
converged: YES YES NO NO
title: Mulliken charges:
elementType: S O O O N N C C C C C C C C C C C C C H H H H H H H H H H H H H H H H H H H H
charge: 0.884348 -0.555341 -0.561817 -0.230249 -0.251543 -0.416361 -0.259604 -0.063763 -0.653744 -0.658396 -0.249155 -0.271187 0.299716 -0.360667 -0.358824 -0.043577 0.178882 -0.649470 -0.704574 0.264522 0.222954 0.242943 0.269191 0.229195 0.262624 0.239491 0.291962 0.289223 0.182522 0.282316 0.244015 0.284533 0.204050 0.237240 0.216536 0.207517 0.220710 0.238635 0.295149
chargesum: 0.00000
title: Mulliken charges with hydrogens summed into heavy atoms:
elementType: S O O O N N C C C C C C C C C C C C C
charge: 0.884348 -0.555341 -0.561817 -0.230249 0.032990 -0.121212 0.004918 -0.063763 0.081344 0.072913 0.042806 0.018036 0.299716 -0.078351 -0.114809 0.138944 0.178882 0.008356 -0.037712
polarizability: 2.86086940e+02 2.44586384e+00 1.77674021e+02 -7.60399116e+00 5.19943473e+00 1.38154439e+02
1716.lowfreq: -5.8938 -0.0014 -0.0012 0.0010 2.3951 10.9915 20.1528 28.1905 34.1563
frequency: 19.5915 28.1353 34.1363 40.0138 48.2001 53.7742 64.7084 97.8557 111.1785 173.0491 177.8259 184.5977 193.6439 201.2820 208.4315 234.3665 238.0976 239.8851 262.0381 287.3437 304.9677 321.1615 340.4831 356.3632 377.5250 406.7202 409.0445 415.4370 429.3028 468.9557 488.1080 516.5314 537.1566 582.5663 608.2918 618.5940 684.7777 699.1245 755.2386 787.9075 822.2068 851.6816 862.9743 872.5291 872.7481 909.8902 919.2836 934.6521 944.4165 948.2628 958.5775 972.6043 992.3397 996.9862 1034.1684 1040.0831 1053.9186 1110.8834 1114.6481 1138.1454 1166.5226 1166.6636 1181.1098 1185.7093 1201.6622 1226.7149 1258.1020 1291.8345 1310.0505 1317.4818 1334.1841 1376.5586 1379.8844 1383.8457 1385.7771 1392.4860 1397.7672 1430.8922 1454.7802 1458.8803 1465.0457 1467.7736 1468.3870 1470.2660 1475.2928 1488.2509 1488.5020 1513.9251 1583.4082 1591.0639 1626.5161 2848.2576 2980.3492 2982.7184 2985.7540 2987.6861 3047.5578 3073.2916 3074.8659 3081.1161 3082.6942 3095.4038 3096.1567 3101.0033 3102.4904 3133.3974 3150.3782 3157.2602 3169.8205 3392.0122 3429.6841
redmass: 4.1711 3.5314 2.7594 4.2068 4.1908 3.7673 4.2979 4.8657 7.0898 2.4953 4.9297 2.2507 1.6194 2.0416 1.7502 1.9720 1.5133 1.2188 3.9475 4.1028 4.8202 4.4215 5.8606 2.8459 2.9591 2.3665 2.8963 4.1884 2.4375 2.8597 2.8297 7.3184 4.0915 1.2688 3.0243 6.0007 4.7351 5.7919 3.4659 13.9604 2.7670 1.4552 4.5215 1.5490 2.4303 6.8144 1.2282 1.1944 1.5967 1.3631 1.6574 1.3706 1.5758 3.6039 5.0820 1.3924 2.2077 1.5173 1.7165 2.1842 1.8923 1.9816 1.2205 2.0187 3.6377 1.2853 2.6328 1.2709 1.5816 1.4462 1.3020 1.2259 3.9248 1.2102 5.0797 1.2253 1.1919 1.2309 1.0443 1.0924 1.9523 1.0486 1.0604 1.0511 1.0811 1.0532 1.0680 1.5050 7.4506 6.3220 8.4461 1.0821 1.0372 1.0360 1.0360 1.0356 1.0875 1.0977 1.0981 1.0981 1.0992 1.1007 1.1005 1.1000 1.1005 1.0884 1.0888 1.0958 1.0967 1.0763 1.0759
irintensity: 3.2241 0.7846 0.6796 3.6842 2.3432 2.9216 0.5187 3.6257 5.8137 0.6756 2.5345 0.4104 3.2910 1.8516 4.4846 12.2650 14.7612 0.7529 4.5839 2.8433 1.7296 4.2990 14.4714 15.3105 2.7310 43.8993 0.9655 3.8700 25.3833 1.7132 17.7146 43.6426 40.9975 86.2942 61.4553 1.3673 30.2308 12.0312 12.6943 79.2783 4.2515 10.7467 33.2635 24.4389 2.6143 65.8364 3.8212 13.6197 0.6759 1.4225 0.2619 2.2658 5.8675 9.9967 55.2213 32.1939 19.3975 25.3386 8.2515 0.2528 31.8132 8.7328 0.8323 4.4228 68.1729 24.2071 110.8307 2.4877 0.4895 1.6332 27.6195 20.2655 3.8971 31.2727 13.3945 18.7482 28.3572 26.9774 11.3281 20.4508 6.0110 1.0995 14.9721 2.1633 22.0790 19.1271 22.8825 81.5289 13.9812 14.1806 148.9703 88.5818 37.8136 9.4008 24.4913 15.9647 5.7033 30.2994 8.4392 10.4935 49.2916 11.9144 6.4475 47.0242 14.7091 10.1690 1.8547 7.6742 0.6785 52.1361 1.1511
temp: 298.150 k
press: 1.00000 atm
elementType: 16 8 8 8 7 7 6 6 6 6 6 6 6 6 6 6 6 6 6 1 1 1 1 1 1 1 1 1 1 1 1 1 1 1 1 1 1 1 1
symmnumber: 1
zpe: 821048.8 jmol-1
zpe.correction: 0.312721 hartree
zpe.thermalcorrener: 0.334844 hartree
zpe.thermalcorrenthalpy: 0.335788 hartree
zpe.thermalcorrgfe: 0.259168 hartree
zpe.sumelectzpe: -1238.980192 hartree
zpe.sumelectthermal: -1238.958069 hartree
zpe.sumelectthermalent: -1238.957125 hartree
zpe.sumelectthermalfe: -1239.033746 hartree
dipole: 3.2089 -3.1701 2.6181
dipole: 5.2155
quadrupole: -113.7786 -127.6517 -125.3665
quadrupole: -14.9293 -33.2155 -5.2101
quadrupole: 8.4870 -5.3861 -3.1009 -14.9293 -33.2155 -5.2101
hfenergy: -1239.2929132 hartree
pointgroup: C01[X(C13H20N2O3S1)]
dipole: 1.2501236 1.2941425 -0.9862882 debye
polarizability: 286.0662927|-1.2677867|177.274407|8.1269963|6.4699572|138.5747006 unknown
InChI: InChI=1S/C13H20N2O3S/c1-9(2)14-15-13(16)11-5-7-12(8-6-11)19(17,18)10(3)4/h5-10,14-15H,1-4H3
charge 0 multiplicity 1
39 atoms
S  -3.711589 0.262891 0.594157
O  -4.384919 -1.094902 1.221857
O  -3.831845 1.719702 1.340907
O  2.711766 -1.949567 -0.666112
N  4.610995 -0.149667 0.486099
N  3.213023 -0.035875 0.606384
C  -4.446554 0.499187 -1.255362
C  -1.857727 -0.083865 0.3732
C  -5.806316 1.168678 -1.064731
C  -4.457805 -0.876116 -1.914385
C  -1.430141 -1.419553 0.284776
C  -0.98233 1.01321 0.362399
C  0.87519 -0.582532 0.142408
C  -0.046394 -1.661118 0.15519
C  0.401283 0.752539 0.243439
C  5.308803 1.059373 -0.030913
C  2.34255 -0.925706 -0.027887
C  4.921018 1.305998 -1.501189
C  6.822758 0.822457 0.134151
H  -3.695617 1.187043 -1.683294
H  -6.208063 1.459222 -2.053727
H  -6.525081 0.478729 -0.588712
H  -5.72014 2.075586 -0.441708
H  -4.944815 -0.798512 -2.904814
H  -5.035227 -1.591662 -1.301881
H  -3.441154 -1.277981 -2.067869
H  -2.158157 -2.235364 0.345266
H  -1.373135 2.030537 0.470757
H  5.026896 1.964737 0.566566
H  0.342841 -2.679335 0.05728
H  1.098293 1.597081 0.196886
H  5.040641 -0.558833 1.327041
H  5.408142 2.222401 -1.881176
H  5.230784 0.446616 -2.120666
H  3.828235 1.42627 -1.609905
H  7.102552 0.682413 1.196234
H  7.388872 1.687324 -0.252276
H  7.12813 -0.076998 -0.42938
H  2.815433 0.692494 1.21639
