program: Orca
programVersion: 4.2.1
elementType: Cl Cl Cl S N N N N C C C C C C C C C C C C C C C C C H H H H H H H H H H H H H
charge: 0
multiplicity: 1
keywords: wb97x-d3
keywords: def2-TZVPP
keywords: def2/J RIJCOSX GRIDX6 NOFINALGRIDX
keywords: grid4 nofinalgrid
keywords: scfconv7
keywords: smallprint printgap noloewdin
keywords: NOSOSCF
formula: C17H13Cl3N4S
InChI: InChI=1S/C17H13Cl3N4S/c18-13-3-1-12(2-4-13)9-25-17(8-24-11-21-10-22-24)23-16-6-5-14(19)7-15(16)20/h1-7,10-11H,8-9H2
38 atoms
Cl 0.071052 2.840218 0.07899
Cl 6.745862 0.802591 1.101943
Cl -5.008656 3.89325 -1.279633
S  0.613641 -2.212183 0.269259
N  -2.238272 -2.581453 1.259107
N  -0.640934 0.010107 -0.447608
N  -2.958567 -2.868389 0.173837
N  -2.82184 -4.649594 1.520917
C  -1.646751 -1.280459 1.420809
C  1.706867 -1.642187 -1.070406
C  -0.641795 -0.989234 0.323806
C  2.965667 -1.026328 -0.543173
C  2.945485 0.232866 0.051046
C  4.174171 -1.70792 -0.621676
C  -1.699143 0.901533 -0.561269
C  4.101088 0.801676 0.557669
C  5.343224 -1.152329 -0.120329
C  -2.158356 -3.653015 2.052339
C  -1.485269 2.27253 -0.406674
C  -2.974457 0.484523 -0.947061
C  5.294936 0.099806 0.467729
C  -2.494189 3.19645 -0.617772
C  -3.995185 1.39247 -1.166209
C  -3.746146 2.744754 -1.000605
C  -3.288489 -4.117804 0.374085
H  -1.13508 -1.255924 2.383815
H  -2.426332 -0.521278 1.449189
H  1.132946 -0.943507 -1.680546
H  1.921139 -2.519461 -1.679844
H  2.012667 0.778008 0.118192
H  4.21412 -2.689226 -1.078379
H  4.071393 1.781378 1.01535
H  6.275888 -1.695758 -0.188618
H  -1.621559 -3.65464 2.988265
H  -3.163626 -0.572064 -1.091857
H  -2.302205 4.252237 -0.484857
H  -4.971966 1.040976 -1.468706
H  -3.889217 -4.668248 -0.333052
elementType: Cl S N C H
totalener: -2653.54351218 hartree
nucrepener: 2614.92427670 hartree
electener: -5268.46778887 hartree
oneelecener: -8845.28233584 hartree
twoeener: 3576.81454697 hartree
cpcmener: -0.02592871 hartree
kineticenergy: 2647.21241583 hartree
xcener: -168.231356317759 hartree
chargesum: 0.0000000
charge: -0.079154 -0.099249 -0.089797 -0.073938 0.122522 -0.318969 -0.363454 -0.407364 -0.119733 -0.053116 0.190348 -0.020771 -0.132560 -0.188034 0.197760 -0.166034 -0.130220 0.080388 -0.050578 -0.244279 0.098871 -0.082975 -0.109656 0.055319 0.083723 0.146144 0.158110 0.141726 0.140401 0.115784 0.141341 0.137468 0.143880 0.180940 0.162134 0.125338 0.145802 0.161879
qa: -0.0792 -0.0992 -0.0898 -0.0739 0.1225 -0.3190 -0.3635 -0.4074 -0.1197 -0.0531 0.1903 -0.0208 -0.1326 -0.1880 0.1978 -0.1660 -0.1302 0.0804 -0.0506 -0.2443 0.0989 -0.0830 -0.1097 0.0553 0.0837 0.1461 0.1581 0.1417 0.1404 0.1158 0.1413 0.1375 0.1439 0.1809 0.1621 0.1253 0.1458 0.1619
va: 1.2454 1.2058 1.2133 2.4042 3.3009 2.9463 2.8400 3.0268 3.9004 3.7347 3.8874 3.7112 3.9148 3.9886 3.7049 4.0349 3.9603 4.0331 3.9996 3.9682 3.8295 3.9814 4.0013 3.8759 4.0299 1.0093 0.9867 1.0357 1.0065 1.0396 1.0035 1.0095 1.0043 0.9898 1.0369 1.0181 1.0048 0.9928
dispcorr: -0.020743354 hartree
energy: -2653.564255529612
dipole: -2.21218 2.01876 -0.19341 -20.17057 19.79206 -0.37851 -0.27567 0.67289 0.39722
magnitude: 0.58177 au
magnitude: 1.47875 debye
