program: Orca
programVersion: 4.2.1
elementType: Cl Cl Cl S N N N N C C C C C C C C C C C C C C C C C H H H H H H H H H H H H H
charge: 0
multiplicity: 1
keywords: wb97x-d3
keywords: def2-TZVPP
keywords: def2/J RIJCOSX GRIDX6 NOFINALGRIDX
keywords: grid4 nofinalgrid
keywords: scfconv7
keywords: smallprint printgap noloewdin
keywords: NOSOSCF
formula: C17H13Cl3N4S
InChI: InChI=1S/C17H13Cl3N4S/c18-13-3-1-12(2-4-13)9-25-17(8-24-11-21-10-22-24)23-16-6-5-14(19)7-15(16)20/h1-7,10-11H,8-9H2
38 atoms
Cl -1.839295 1.730936 1.793154
Cl 8.195928 -0.309834 0.027432
Cl -6.155313 1.924253 -1.402604
S  1.491457 -1.328983 0.015036
N  -2.29908 -1.999488 0.689136
N  -0.603204 0.195155 -0.391719
N  -3.477622 -2.127232 0.073775
N  -3.767313 -1.50863 2.206559
C  -1.057229 -2.234045 0.000755
C  2.233215 0.287387 -0.370095
C  -0.213198 -0.981332 -0.156435
C  3.721368 0.146365 -0.272416
C  4.376229 0.367525 0.935045
C  4.470738 -0.230347 -1.382509
C  -1.928944 0.542678 -0.621422
C  5.751772 0.230009 1.036011
C  5.846985 -0.372006 -1.299477
C  -2.487266 -1.633042 1.962026
C  -2.622739 1.310904 0.31334
C  -2.569757 0.237116 -1.819454
C  6.476053 -0.139104 -0.086565
C  -3.922505 1.729755 0.089809
C  -3.862205 0.661695 -2.070828
C  -4.532356 1.397854 -1.108446
C  -4.327609 -1.821245 1.018992
H  -1.291447 -2.639279 -0.98376
H  -0.491574 -3.002827 0.530162
H  1.848636 1.020968 0.337565
H  1.921935 0.584963 -1.371018
H  3.811181 0.657307 1.812524
H  3.979474 -0.411619 -2.330674
H  6.248699 0.411951 1.979221
H  6.417981 -0.658655 -2.172086
H  -1.67673 -1.476929 2.656914
H  -2.042467 -0.336684 -2.570667
H  -4.445133 2.307755 0.839483
H  -4.339015 0.411157 -3.008469
H  -5.392997 -1.825494 0.848645
elementType: Cl S N C H
totalener: -2653.54206075 hartree
nucrepener: 2629.39670274 hartree
electener: -5282.93876349 hartree
oneelecener: -8874.43639200 hartree
twoeener: 3591.49762851 hartree
cpcmener: -0.02814972 hartree
kineticenergy: 2647.20312338 hartree
xcener: -168.229618269110 hartree
chargesum: 0.0000000
charge: -0.085265 -0.097128 -0.096143 -0.058676 0.120283 -0.301915 -0.325075 -0.391389 -0.064519 -0.019897 0.152608 -0.006894 -0.185779 -0.187004 0.163012 -0.144618 -0.143939 0.037096 -0.036198 -0.217155 0.096622 -0.085037 -0.101191 0.059393 0.068186 0.152060 0.140824 0.116458 0.120423 0.142960 0.145141 0.145299 0.144360 0.172445 0.144807 0.123643 0.144875 0.157328
qa: -0.0853 -0.0971 -0.0961 -0.0587 0.1203 -0.3019 -0.3251 -0.3914 -0.0645 -0.0199 0.1526 -0.0069 -0.1858 -0.1870 0.1630 -0.1446 -0.1439 0.0371 -0.0362 -0.2172 0.0966 -0.0850 -0.1012 0.0594 0.0682 0.1521 0.1408 0.1165 0.1204 0.1430 0.1451 0.1453 0.1444 0.1724 0.1448 0.1236 0.1449 0.1573
va: 1.2354 1.2082 1.2057 2.4452 3.3425 2.9648 2.8612 3.0060 3.8673 3.8376 3.9832 3.6481 3.9818 3.9815 3.8113 3.9736 3.9719 4.0630 3.8772 4.0180 3.8357 3.9923 3.9631 3.8434 4.0305 1.0009 1.0051 1.0208 1.0144 1.0039 1.0032 1.0045 1.0049 1.0002 1.0024 1.0196 1.0016 0.9981
dispcorr: -0.022810935 hartree
energy: -2653.564871685723
dipole: 4.26095 -3.04810 1.21285 -8.91039 8.06600 -0.84439 -3.80540 2.90052 -0.90488
magnitude: 1.73286 au
magnitude: 4.40458 debye
