program: Orca
programVersion: 4.2.1
elementType: Cl Cl Cl S N N N N C C C C C C C C C C C C C C C C C H H H H H H H H H H H H H
charge: 0
multiplicity: 1
keywords: wb97x-d3
keywords: def2-TZVPP
keywords: def2/J RIJCOSX GRIDX6 NOFINALGRIDX
keywords: grid4 nofinalgrid
keywords: scfconv7
keywords: smallprint printgap noloewdin
keywords: NOSOSCF
formula: C17H13Cl3N4S
InChI: InChI=1S/C17H13Cl3N4S/c18-13-3-1-12(2-4-13)9-25-17(8-24-11-21-10-22-24)23-16-6-5-14(19)7-15(16)20/h1-7,10-11H,8-9H2
38 atoms
Cl -2.336154 0.771197 2.517608
Cl 5.044882 1.202014 -2.887843
Cl -3.042662 4.800181 -0.968402
S  0.675031 -2.487562 1.038591
N  -2.136485 -2.852003 0.242696
N  -0.036883 0.023441 0.757784
N  -1.802398 -4.025708 -0.29963
N  -3.184565 -4.32552 1.436176
C  -1.590788 -1.612029 -0.240317
C  2.139487 -1.563687 1.590472
C  -0.362275 -1.172729 0.527344
C  2.862089 -0.874847 0.470963
C  3.034349 0.504551 0.48251
C  3.381477 -1.602625 -0.595977
C  -0.792781 1.106939 0.329171
C  3.708811 1.151306 -0.542555
C  4.0535 -0.97334 -1.631311
C  -2.957545 -3.04624 1.280591
C  -1.862898 1.60052 1.075825
C  -0.436677 1.790614 -0.831733
C  4.209762 0.404158 -1.595326
C  -2.55896 2.734125 0.688959
C  -1.122129 2.920643 -1.238912
C  -2.180059 3.384835 -0.472784
C  -2.453731 -4.878985 0.446386
H  -2.362852 -0.845081 -0.198173
H  -1.324227 -1.742812 -1.289905
H  2.76838 -2.327413 2.052932
H  1.848675 -0.864822 2.373539
H  2.634435 1.090666 1.299392
H  3.257409 -2.678359 -0.63175
H  3.832918 2.22558 -0.518519
H  4.448688 -1.552223 -2.455141
H  -3.361932 -2.239691 1.872786
H  0.398861 1.427358 -1.415752
H  -3.385851 3.096475 1.284234
H  -0.828779 3.431597 -2.145425
H  -2.406457 -5.941845 0.267975
elementType: Cl S N C H
totalener: -2653.54266212 hartree
nucrepener: 2688.07142667 hartree
electener: -5341.61408879 hartree
oneelecener: -8991.10362127 hartree
twoeener: 3649.48953248 hartree
cpcmener: -0.02563743 hartree
kineticenergy: 2647.21774257 hartree
xcener: -168.231137757323 hartree
chargesum: 0.0000000
charge: -0.082235 -0.102208 -0.090575 -0.073139 0.083243 -0.286317 -0.332602 -0.404654 -0.107970 -0.032332 0.170989 0.063081 -0.199551 -0.220646 0.168960 -0.138168 -0.131210 0.094400 -0.073481 -0.204552 0.080854 -0.078182 -0.111334 0.058950 0.073497 0.158557 0.151679 0.153639 0.117276 0.131119 0.133705 0.142692 0.144770 0.159142 0.145150 0.128035 0.146148 0.163271
qa: -0.0822 -0.1022 -0.0906 -0.0731 0.0832 -0.2863 -0.3326 -0.4047 -0.1080 -0.0323 0.1710 0.0631 -0.1996 -0.2206 0.1690 -0.1382 -0.1312 0.0944 -0.0735 -0.2046 0.0809 -0.0782 -0.1113 0.0590 0.0735 0.1586 0.1517 0.1536 0.1173 0.1311 0.1337 0.1427 0.1448 0.1591 0.1451 0.1280 0.1461 0.1633
va: 1.2433 1.2031 1.2117 2.4061 3.3338 2.9774 2.8642 3.0387 3.8905 3.8078 3.9324 3.5422 3.9420 4.0178 3.7247 3.9432 3.9662 4.0477 3.9617 4.0027 3.8366 3.9965 3.9836 3.8642 4.0331 0.9873 1.0069 0.9977 1.0351 1.0146 1.0137 1.0048 1.0040 1.0090 1.0040 1.0174 1.0034 0.9939
dispcorr: -0.022302995 hartree
energy: -2653.564965117632
dipole: 5.56712 -5.19453 0.37259 -15.48022 15.98526 0.50504 1.98248 -2.05083 -0.06835
magnitude: 0.63132 au
magnitude: 1.60469 debye
