program: Orca
programVersion: 4.2.1
elementType: Cl Cl Cl S N N N N C C C C C C C C C C C C C C C C C H H H H H H H H H H H H H
charge: 0
multiplicity: 1
keywords: wb97x-d3
keywords: def2-TZVPP
keywords: def2/J RIJCOSX GRIDX6 NOFINALGRIDX
keywords: grid4 nofinalgrid
keywords: scfconv7
keywords: smallprint printgap noloewdin
keywords: NOSOSCF
formula: C17H13Cl3N4S
InChI: InChI=1S/C17H13Cl3N4S/c18-13-3-1-12(2-4-13)9-25-17(8-24-11-21-10-22-24)23-16-6-5-14(19)7-15(16)20/h1-7,10-11H,8-9H2
38 atoms
Cl -2.174486 -1.584294 -2.590073
Cl 4.764677 2.802403 1.834545
Cl -4.311985 3.074471 -1.001291
S  1.579915 -2.941439 -0.349465
N  -1.637113 -1.646141 1.407057
N  0.130725 -0.806167 -0.813583
N  -2.909167 -1.306336 1.188248
N  -2.077816 -0.164324 2.925064
C  -0.944755 -2.586178 0.566054
C  2.706729 -1.88858 -1.310508
C  0.155983 -1.931443 -0.247794
C  3.221178 -0.717006 -0.528904
C  2.91716 0.583785 -0.913885
C  4.020137 -0.910814 0.594479
C  -0.952882 0.060793 -0.825599
C  3.392607 1.672082 -0.197061
C  4.500419 0.163752 1.324944
C  -1.152892 -0.956072 2.445036
C  -2.069374 -0.146354 -1.635708
C  -0.893293 1.244493 -0.0916
C  4.177246 1.45093 0.922332
C  -3.100445 0.774907 -1.702997
C  -1.921548 2.167279 -0.128661
C  -3.020486 1.92404 -0.937347
C  -3.131364 -0.416714 2.119892
H  -1.674799 -3.03745 -0.105867
H  -0.539014 -3.39054 1.180884
H  2.202272 -1.578138 -2.224699
H  3.518682 -2.560093 -1.596149
H  2.296874 0.757656 -1.782822
H  4.273285 -1.914627 0.914574
H  3.145418 2.677748 -0.509393
H  5.119014 -0.002998 2.196416
H  -0.141858 -1.065221 2.807238
H  -0.023342 1.434331 0.523265
H  -3.955715 0.589039 -2.337803
H  -1.858178 3.069578 0.463757
H  -4.08885 0.06816 2.227322
elementType: Cl S N C H
totalener: -2653.54028757 hartree
nucrepener: 2772.40501786 hartree
electener: -5425.94530542 hartree
oneelecener: -9160.55255921 hartree
twoeener: 3734.60725378 hartree
cpcmener: -0.02536333 hartree
kineticenergy: 2647.22039165 hartree
xcener: -168.235342463113 hartree
chargesum: 0.0000000
charge: -0.085216 -0.101013 -0.095440 -0.067875 0.122228 -0.279198 -0.326056 -0.395436 -0.087413 -0.047353 0.128986 0.061439 -0.192436 -0.220570 0.184587 -0.139791 -0.130487 0.057903 -0.017127 -0.231535 0.081038 -0.105997 -0.113224 0.072166 0.071852 0.149744 0.141157 0.119472 0.154989 0.133384 0.135533 0.143817 0.143724 0.168496 0.142828 0.122560 0.142866 0.157395
qa: -0.0852 -0.1010 -0.0954 -0.0679 0.1222 -0.2792 -0.3261 -0.3954 -0.0874 -0.0474 0.1290 0.0614 -0.1924 -0.2206 0.1846 -0.1398 -0.1305 0.0579 -0.0171 -0.2315 0.0810 -0.1060 -0.1132 0.0722 0.0719 0.1497 0.1412 0.1195 0.1550 0.1334 0.1355 0.1438 0.1437 0.1685 0.1428 0.1226 0.1429 0.1574
va: 1.2427 1.2049 1.2067 2.4090 3.3330 2.9829 2.8595 3.0141 3.8667 3.8128 3.9919 3.5433 3.9553 4.0150 3.7377 3.9446 3.9636 4.0671 3.9310 3.9302 3.8404 4.0408 3.9735 3.8355 4.0242 1.0124 1.0077 1.0338 0.9979 1.0128 1.0109 1.0045 1.0042 0.9979 1.0079 1.0192 1.0041 0.9976
dispcorr: -0.025340444 hartree
energy: -2653.565628010286
dipole: 9.95339 -8.51474 1.43865 -10.41995 8.64581 -1.77414 4.28728 -4.68481 -0.39754
magnitude: 2.31848 au
magnitude: 5.89310 debye
