program: Orca
programVersion: 4.2.1
elementType: Cl Cl Cl S N N N N C C C C C C C C C C C C C C C C C H H H H H H H H H H H H H
charge: 0
multiplicity: 1
keywords: wb97x-d3
keywords: def2-TZVPP
keywords: def2/J RIJCOSX GRIDX6 NOFINALGRIDX
keywords: grid4 nofinalgrid
keywords: scfconv7
keywords: smallprint printgap noloewdin
keywords: NOSOSCF
formula: C17H13Cl3N4S
InChI: InChI=1S/C17H13Cl3N4S/c18-13-3-1-12(2-4-13)9-25-17(8-24-11-21-10-22-24)23-16-6-5-14(19)7-15(16)20/h1-7,10-11H,8-9H2
38 atoms
Cl -2.571608 -0.467047 -2.825959
Cl 4.482754 2.22659 2.081247
Cl -2.927449 4.710398 -1.450498
S  0.483051 -2.92131 -0.318505
N  -1.734133 -2.39079 1.54316
N  -0.148215 -0.477198 -1.023053
N  -1.063124 -1.88261 2.577239
N  -1.786864 -3.949392 3.044835
C  -1.861356 -1.651078 0.319161
C  2.017436 -2.278735 -1.046048
C  -0.535531 -1.499606 -0.395781
C  2.632393 -1.160922 -0.255209
C  2.871937 -1.288048 1.109044
C  2.981145 0.028217 -0.884929
C  -0.861328 0.709851 -1.094477
C  3.442352 -0.253536 1.833269
C  3.558708 1.071955 -0.178015
C  -2.156257 -3.626005 1.831499
C  -1.97555 0.878138 -1.917508
C  -0.398361 1.822103 -0.390868
C  3.779537 0.922486 1.181182
C  -2.614461 2.102244 -2.0362
C  -1.028612 3.048469 -0.48589
C  -2.134684 3.179333 -1.312118
C  -1.121462 -2.849648 3.454304
H  -2.288209 -0.671221 0.534336
H  -2.560838 -2.180688 -0.328866
H  1.831007 -1.981424 -2.077038
H  2.675327 -3.150366 -1.0728
H  2.599568 -2.199481 1.626562
H  2.79235 0.152769 -1.943623
H  3.61725 -0.364858 2.89484
H  3.819841 1.992069 -0.683185
H  -2.720662 -4.232481 1.140285
H  0.475496 1.710772 0.237984
H  -3.4757 2.206439 -2.681675
H  -0.655178 3.892617 0.077174
H  -0.67248 -2.761069 4.431324
elementType: Cl S N C H
totalener: -2653.54285366 hartree
nucrepener: 2720.82190892 hartree
electener: -5374.36476258 hartree
oneelecener: -9057.23069656 hartree
twoeener: 3682.86593398 hartree
cpcmener: -0.02592244 hartree
kineticenergy: 2647.22666736 hartree
xcener: -168.233751474934 hartree
chargesum: 0.0000000
charge: -0.081097 -0.104094 -0.090218 -0.083735 0.065531 -0.272396 -0.329687 -0.405951 -0.069267 -0.037756 0.166487 0.103457 -0.218331 -0.219280 0.139724 -0.126639 -0.145747 0.078033 -0.029472 -0.191758 0.085400 -0.089789 -0.127568 0.068358 0.068152 0.149279 0.136438 0.113167 0.149419 0.126597 0.128852 0.143523 0.142911 0.180314 0.142736 0.126981 0.144692 0.162735
qa: -0.0811 -0.1041 -0.0902 -0.0837 0.0655 -0.2724 -0.3297 -0.4060 -0.0693 -0.0378 0.1665 0.1035 -0.2183 -0.2193 0.1397 -0.1266 -0.1457 0.0780 -0.0295 -0.1918 0.0854 -0.0898 -0.1276 0.0684 0.0682 0.1493 0.1364 0.1132 0.1494 0.1266 0.1289 0.1435 0.1429 0.1803 0.1427 0.1270 0.1447 0.1627
va: 1.2460 1.2000 1.2124 2.3984 3.4135 2.9976 2.8705 3.0255 3.8635 3.8334 3.9363 3.5290 4.0095 3.9530 3.7522 3.9682 3.9364 4.0418 3.9718 4.0053 3.8205 4.0059 4.0111 3.8522 4.0443 0.9991 1.0031 1.0339 0.9983 1.0185 1.0116 1.0041 1.0049 0.9897 1.0042 1.0171 1.0047 0.9943
dispcorr: -0.022858730 hartree
energy: -2653.565712389009
dipole: 6.46777 -6.74466 -0.27689 -15.68723 15.00763 -0.67961 5.07216 -6.27672 -1.20456
magnitude: 1.41049 au
magnitude: 3.58519 debye
