program: Orca
programVersion: 4.2.1
elementType: Cl Cl Cl S N N N N C C C C C C C C C C C C C C C C C H H H H H H H H H H H H H
charge: 0
multiplicity: 1
keywords: wb97x-d3
keywords: def2-TZVPP
keywords: def2/J RIJCOSX GRIDX6 NOFINALGRIDX
keywords: grid4 nofinalgrid
keywords: scfconv7
keywords: smallprint printgap noloewdin
keywords: NOSOSCF
formula: C17H13Cl3N4S
InChI: InChI=1S/C17H13Cl3N4S/c18-13-3-1-12(2-4-13)9-25-17(8-24-11-21-10-22-24)23-16-6-5-14(19)7-15(16)20/h1-7,10-11H,8-9H2
38 atoms
Cl -1.921019 0.837845 3.299291
Cl 3.581208 0.941246 -3.849342
Cl -2.713435 5.010431 0.012505
S  0.752528 -2.549911 1.47002
N  -1.820191 -2.699351 -0.01523
N  0.119096 -0.019427 1.231178
N  -1.44636 -2.527532 -1.283215
N  -1.968649 -4.670595 -0.897475
C  -1.75843 -1.605178 0.914087
C  2.361971 -1.715152 1.407139
C  -0.327238 -1.196769 1.189193
C  2.647887 -1.060101 0.086697
C  2.508064 -1.752262 -1.111852
C  3.076716 0.261501 0.045849
C  -0.621718 1.117028 0.945221
C  2.794453 -1.145306 -2.324442
C  3.372344 0.884234 -1.157625
C  -2.122805 -3.98163 0.205696
C  -1.559749 1.661715 1.822705
C  -0.349679 1.815665 -0.231639
C  3.225189 0.172337 -2.336549
C  -2.206049 2.857145 1.546837
C  -0.991495 3.00195 -0.531133
C  -1.915451 3.516808 0.365996
C  -1.551594 -3.734604 -1.773282
H  -2.236835 -1.91505 1.844066
H  -2.324983 -0.764162 0.514918
H  3.077407 -2.51524 1.611845
H  2.432515 -1.002111 2.227394
H  2.161547 -2.778116 -1.111821
H  3.177015 0.825514 0.964454
H  2.680705 -1.69727 -3.247624
H  3.701313 1.914623 -1.169612
H  -2.447449 -4.353059 1.165025
H  0.385643 1.412541 -0.915891
H  -2.927568 3.259532 2.244631
H  -0.765675 3.519298 -1.45334
H  -1.327775 -3.950483 -2.806701
elementType: Cl S N C H
totalener: -2653.54241976 hartree
nucrepener: 2732.83951960 hartree
electener: -5386.38193936 hartree
oneelecener: -9081.30323511 hartree
twoeener: 3694.92129575 hartree
cpcmener: -0.02588147 hartree
kineticenergy: 2647.22437254 hartree
xcener: -168.233284525878 hartree
chargesum: 0.0000000
charge: -0.080029 -0.103888 -0.090352 -0.085880 0.075156 -0.270897 -0.331213 -0.405393 -0.077518 -0.041644 0.164970 0.101841 -0.205141 -0.222963 0.154231 -0.132453 -0.151700 0.071657 -0.032225 -0.182706 0.091597 -0.094816 -0.139811 0.075341 0.068728 0.140285 0.148620 0.149070 0.113437 0.127251 0.128810 0.142822 0.142965 0.182130 0.138731 0.126244 0.143410 0.161333
qa: -0.0800 -0.1039 -0.0904 -0.0859 0.0752 -0.2709 -0.3312 -0.4054 -0.0775 -0.0416 0.1650 0.1018 -0.2051 -0.2230 0.1542 -0.1325 -0.1517 0.0717 -0.0322 -0.1827 0.0916 -0.0948 -0.1398 0.0753 0.0687 0.1403 0.1486 0.1491 0.1134 0.1273 0.1288 0.1428 0.1430 0.1821 0.1387 0.1262 0.1434 0.1613
va: 1.2461 1.2001 1.2118 2.3891 3.4084 3.0113 2.8688 3.0243 3.8722 3.8350 3.9307 3.5395 4.0012 3.9467 3.7523 3.9794 3.9364 4.0453 3.9625 3.9987 3.8153 4.0107 4.0291 3.8439 4.0404 1.0022 0.9998 0.9978 1.0334 1.0174 1.0111 1.0047 1.0052 0.9897 1.0053 1.0176 1.0056 0.9949
dispcorr: -0.023345975 hartree
energy: -2653.565765737553
dipole: 6.60789 -6.54299 0.06489 -16.66228 16.41706 -0.24522 0.48635 0.99051 1.47686
magnitude: 1.49848 au
magnitude: 3.80884 debye
