program: Orca
programVersion: 4.2.1
elementType: Cl Cl Cl S N N N N C C C C C C C C C C C C C C C C C H H H H H H H H H H H H H
charge: 0
multiplicity: 1
keywords: wb97x-d3
keywords: def2-TZVPP
keywords: def2/J RIJCOSX GRIDX6 NOFINALGRIDX
keywords: grid4 nofinalgrid
keywords: scfconv7
keywords: smallprint printgap noloewdin
keywords: NOSOSCF
formula: C17H13Cl3N4S
InChI: InChI=1S/C17H13Cl3N4S/c18-13-3-1-12(2-4-13)9-25-17(8-24-11-21-10-22-24)23-16-6-5-14(19)7-15(16)20/h1-7,10-11H,8-9H2
38 atoms
Cl -1.943126 0.602784 3.398971
Cl 3.485194 1.148251 -3.766853
Cl -2.760769 4.942617 0.341278
S  0.740202 -2.655333 1.345228
N  -1.74503 -2.565398 -0.335978
N  0.140905 -0.100386 1.329689
N  -2.138466 -3.827465 -0.159931
N  -1.424889 -3.510533 -2.258276
C  -1.725582 -1.618352 0.747759
C  2.370676 -1.852872 1.323626
C  -0.309912 -1.265026 1.152925
C  2.648128 -1.113165 0.047334
C  2.512038 -1.733819 -1.191142
C  3.054201 0.215703 0.084826
C  -0.599121 1.052258 1.099576
C  2.767828 -1.046295 -2.366797
C  3.322861 0.917319 -1.081462
C  -1.314687 -2.390896 -1.588641
C  -1.564132 1.526429 1.988266
C  -0.317486 1.821071 -0.029126
C  3.170558 0.278815 -2.300785
C  -2.230275 2.721805 1.766985
C  -0.979312 3.009362 -0.274581
C  -1.931804 3.452486 0.63029
C  -1.934318 -4.354814 -1.338957
H  -2.253499 -2.066683 1.589548
H  -2.271972 -0.721063 0.457383
H  3.068558 -2.682553 1.457793
H  2.469169 -1.202366 2.19132
H  2.194025 -2.767586 -1.250079
H  3.156356 0.722066 1.036087
H  2.655934 -1.541581 -3.321825
H  3.634309 1.952071 -1.033495
H  -0.940375 -1.448917 -1.959465
H  0.438736 1.471706 -0.720342
H  -2.975292 3.068058 2.470177
H  -0.749193 3.581955 -1.162331
H  -2.163698 -5.38806 -1.54745
elementType: Cl S N C H
totalener: -2653.54072767 hartree
nucrepener: 2741.75892232 hartree
electener: -5395.29964998 hartree
oneelecener: -9098.28619213 hartree
twoeener: 3702.98654215 hartree
cpcmener: -0.02445599 hartree
kineticenergy: 2647.22382730 hartree
xcener: -168.232628250607 hartree
chargesum: -0.0000000
charge: -0.076192 -0.101523 -0.088600 -0.075733 0.087296 -0.264810 -0.337342 -0.400463 -0.070894 -0.039318 0.110775 0.109203 -0.249785 -0.213936 0.153010 -0.125597 -0.157830 0.081698 -0.034790 -0.167088 0.102195 -0.096156 -0.147668 0.077678 0.067456 0.141416 0.162246 0.151244 0.114485 0.135505 0.131993 0.145457 0.143785 0.163439 0.134578 0.126871 0.143253 0.164141
qa: -0.0762 -0.1015 -0.0886 -0.0757 0.0873 -0.2648 -0.3373 -0.4005 -0.0709 -0.0393 0.1108 0.1092 -0.2498 -0.2139 0.1530 -0.1256 -0.1578 0.0817 -0.0348 -0.1671 0.1022 -0.0962 -0.1477 0.0777 0.0675 0.1414 0.1622 0.1512 0.1145 0.1355 0.1320 0.1455 0.1438 0.1634 0.1346 0.1269 0.1433 0.1641
va: 1.2493 1.2032 1.2135 2.3903 3.3743 3.0068 2.8604 3.0203 3.8474 3.8256 3.9865 3.5133 3.9894 3.9338 3.7553 3.9573 3.9309 4.0525 3.9775 3.9711 3.8095 4.0177 4.0433 3.8477 4.0404 1.0130 0.9909 0.9975 1.0336 1.0169 1.0106 1.0036 1.0053 0.9980 1.0067 1.0174 1.0059 0.9935
dispcorr: -0.024134264 hartree
energy: -2653.564861929492
dipole: 7.50516 -7.01583 0.48933 -15.55946 15.95780 0.39834 -1.78118 2.56525 0.78407
magnitude: 1.00642 au
magnitude: 2.55812 debye
