program: Orca
programVersion: 4.2.1
elementType: Cl Cl Cl S N N N N C C C C C C C C C C C C C C C C C H H H H H H H H H H H H H
charge: 0
multiplicity: 1
keywords: wb97x-d3
keywords: def2-TZVPP
keywords: def2/J RIJCOSX GRIDX6 NOFINALGRIDX
keywords: grid4 nofinalgrid
keywords: scfconv7
keywords: smallprint printgap noloewdin
keywords: NOSOSCF
formula: C17H13Cl3N4S
InChI: InChI=1S/C17H13Cl3N4S/c18-13-3-1-12(2-4-13)9-25-17(8-24-11-21-10-22-24)23-16-6-5-14(19)7-15(16)20/h1-7,10-11H,8-9H2
38 atoms
Cl -2.00675 0.482951 3.407265
Cl 3.283539 1.032568 -3.873718
Cl -2.896616 4.862947 0.438807
S  0.802267 -2.640832 1.4511
N  -1.593215 -2.462048 -0.41202
N  0.161072 -0.095955 1.378834
N  -1.832479 -3.775628 -0.39631
N  -1.097338 -3.134142 -2.415416
C  -1.66419 -1.671013 0.787231
C  2.408783 -1.799758 1.357546
C  -0.270562 -1.271442 1.233111
C  2.630355 -1.104473 0.04428
C  2.395416 -1.750704 -1.165267
C  3.075276 0.211274 0.018213
C  -0.610869 1.036725 1.158382
C  2.592728 -1.101051 -2.372552
C  3.290069 0.872262 -1.181478
C  -1.142413 -2.09625 -1.622088
C  -1.618801 1.450769 2.030725
C  -0.323459 1.848817 0.061631
C  3.041745 0.210831 -2.37332
C  -2.319387 2.627766 1.819151
C  -1.024144 3.016996 -0.172043
C  -2.020398 3.402485 0.712289
C  -1.527935 -4.136099 -1.618352
H  -2.155232 -2.272644 1.551329
H  -2.275436 -0.785164 0.613672
H  3.134179 -2.602708 1.507662
H  2.504889 -1.107276 2.192496
H  2.028315 -2.769495 -1.174196
H  3.243294 0.739724 0.947965
H  2.394153 -1.612731 -3.304092
H  3.636154 1.896715 -1.187334
H  -0.865459 -1.082503 -1.870722
H  0.473532 1.548135 -0.606701
H  -3.093616 2.928382 2.510641
H  -0.792981 3.627277 -1.03364
H  -1.626369 -5.157194 -1.951243
totalener: -2653.51039754 hartree
nucrepener: 2762.77537985 hartree
electener: -5416.28577738 hartree
oneelecener: -9140.52564436 hartree
twoeener: 3724.23986698 hartree
kineticenergy: 2647.23007897 hartree
xcener: -168.233318837478 hartree
chargesum: 0.0000000
charge: -0.062180 -0.076464 -0.068023 -0.041558 0.092740 -0.258235 -0.290692 -0.329708 -0.117734 -0.072280 0.108132 0.103607 -0.231490 -0.190587 0.180536 -0.124458 -0.145348 0.043313 -0.060199 -0.162949 0.096550 -0.097059 -0.139721 0.075376 0.066801 0.148734 0.148620 0.137970 0.111187 0.129923 0.112659 0.135913 0.127697 0.143912 0.124758 0.118328 0.126710 0.135221
qa: -0.0622 -0.0765 -0.0680 -0.0416 0.0927 -0.2582 -0.2907 -0.3297 -0.1177 -0.0723 0.1081 0.1036 -0.2315 -0.1906 0.1805 -0.1245 -0.1453 0.0433 -0.0602 -0.1629 0.0965 -0.0971 -0.1397 0.0754 0.0668 0.1487 0.1486 0.1380 0.1112 0.1299 0.1127 0.1359 0.1277 0.1439 0.1248 0.1183 0.1267 0.1352
va: 1.2646 1.2300 1.2355 2.3973 3.3418 3.0044 2.8587 3.0384 3.8927 3.8505 3.9626 3.5535 3.9966 3.9590 3.7427 3.9682 3.9446 4.0687 3.9953 3.9655 3.8853 4.0220 4.0635 3.9221 4.0403 1.0142 0.9937 0.9978 1.0343 1.0184 1.0147 1.0100 1.0113 1.0025 1.0130 1.0208 1.0119 0.9999
dispcorr: -0.024976950 hartree
energy: -2653.535374486096
dipole: 8.38589 -8.01755 0.36833 -14.75777 14.98972 0.23196 -1.75680 2.48479 0.72799
magnitude: 0.84820 au
magnitude: 2.15596 debye
