program: Orca
programVersion: 4.2.1
elementType: Cl Cl Cl S N N N N C C C C C C C C C C C C C C C C C H H H H H H H H H H H H H
charge: 0
multiplicity: 1
keywords: wb97x-d3
keywords: def2-TZVPP
keywords: def2/J RIJCOSX GRIDX6 NOFINALGRIDX
keywords: grid4 nofinalgrid
keywords: scfconv7
keywords: smallprint printgap noloewdin
keywords: NOSOSCF
formula: C17H13Cl3N4S
InChI: InChI=1S/C17H13Cl3N4S/c18-13-3-1-12(2-4-13)9-25-17(8-24-11-21-10-22-24)23-16-6-5-14(19)7-15(16)20/h1-7,10-11H,8-9H2
38 atoms
Cl -1.3053 -0.729361 3.470834
Cl 3.810299 1.97495 -3.718286
Cl -3.799676 3.479822 1.268766
S  1.653198 -2.933402 0.682326
N  -1.923925 -1.891719 -0.366295
N  0.404384 -0.649939 0.982369
N  -1.566642 -1.608026 -1.621054
N  -3.585843 -0.745798 -1.161899
C  -1.037368 -2.62098 0.492437
C  2.998069 -1.738609 0.935184
C  0.262774 -1.876098 0.740214
C  3.19395 -0.812815 -0.229319
C  3.517626 -1.309714 -1.487099
C  3.064803 0.561284 -0.070335
C  -0.630175 0.272725 1.048801
C  3.709886 -0.460801 -2.563333
C  3.258867 1.425819 -1.136134
C  -3.130936 -1.364409 -0.106155
C  -1.464087 0.389783 2.159819
C  -0.790843 1.194081 0.014261
C  3.578334 0.907047 -2.379784
C  -2.434544 1.375383 2.238754
C  -1.767198 2.169221 0.068138
C  -2.585238 2.257428 1.184122
C  -2.591617 -0.9199 -2.059359
H  -0.835257 -3.599452 0.05366
H  -1.534594 -2.783827 1.450321
H  3.880228 -2.36086 1.099067
H  2.803961 -1.188881 1.85553
H  3.606627 -2.378679 -1.638795
H  2.79542 0.966578 0.896025
H  3.956704 -0.858311 -3.53786
H  3.155035 2.493397 -0.999894
H  -3.621563 -1.453695 0.851122
H  -0.13902 1.119085 -0.845701
H  -3.067589 1.445198 3.11193
H  -1.891714 2.858499 -0.754786
H  -2.628355 -0.532834 -3.065397
totalener: -2653.51120417 hartree
nucrepener: 2782.78070152 hartree
electener: -5436.29190569 hartree
oneelecener: -9181.27172795 hartree
twoeener: 3744.97982226 hartree
kineticenergy: 2647.23352268 hartree
xcener: -168.237263538010 hartree
chargesum: -0.0000000
charge: -0.077646 -0.080934 -0.073053 -0.054718 0.115474 -0.283461 -0.300483 -0.316278 -0.146345 -0.089864 0.198099 0.078607 -0.174579 -0.188638 0.225404 -0.108949 -0.127931 0.046049 -0.101016 -0.201235 0.075671 -0.100880 -0.108442 0.097550 0.056224 0.122327 0.136426 0.142034 0.117375 0.109725 0.115841 0.122663 0.124154 0.145708 0.135484 0.115300 0.121149 0.133191
qa: -0.0776 -0.0809 -0.0731 -0.0547 0.1155 -0.2835 -0.3005 -0.3163 -0.1463 -0.0899 0.1981 0.0786 -0.1746 -0.1886 0.2254 -0.1089 -0.1279 0.0460 -0.1010 -0.2012 0.0757 -0.1009 -0.1084 0.0975 0.0562 0.1223 0.1364 0.1420 0.1174 0.1097 0.1158 0.1227 0.1242 0.1457 0.1355 0.1153 0.1211 0.1332
va: 1.2518 1.2261 1.2308 2.4056 3.2873 2.9990 2.8312 3.0431 3.9452 3.8519 3.9163 3.5832 4.0463 3.9740 3.6733 4.0028 3.9665 4.0590 3.9552 3.9416 3.9334 4.0089 4.0216 3.9123 4.0520 1.0148 1.0062 0.9977 1.0346 1.0196 1.0171 1.0112 1.0106 0.9988 1.0141 1.0220 1.0120 1.0022
dispcorr: -0.025515265 hartree
energy: -2653.536719437685
dipole: 7.61178 -6.99385 0.61792 -12.01139 10.93233 -1.07906 -3.07855 3.83695 0.75840
magnitude: 1.45649 au
magnitude: 3.70209 debye
