program: Orca
programVersion: 4.2.1
elementType: Cl Cl Cl S N N N N C C C C C C C C C C C C C C C C C H H H H H H H H H H H H H
charge: 0
multiplicity: 1
keywords: wb97x-d3
keywords: def2-TZVPP
keywords: def2/J RIJCOSX GRIDX6 NOFINALGRIDX
keywords: grid4 nofinalgrid
keywords: scfconv7
keywords: smallprint printgap noloewdin
keywords: NOSOSCF
formula: C17H13Cl3N4S
InChI: InChI=1S/C17H13Cl3N4S/c18-13-3-1-12(2-4-13)9-25-17(8-24-11-21-10-22-24)23-16-6-5-14(19)7-15(16)20/h1-7,10-11H,8-9H2
38 atoms
Cl 0.315099 1.353848 1.095892
Cl 4.778433 2.248421 1.002429
Cl -3.027711 4.689192 -1.448033
S  0.298892 -2.931543 -0.107127
N  -2.270297 -2.692761 1.223609
N  -0.438168 -0.600382 -1.063924
N  -3.056676 -3.368676 0.380572
N  -2.679835 -4.567519 2.238185
C  -1.75519 -1.403585 0.865245
C  1.692731 -2.431003 -1.161404
C  -0.683156 -1.4855 -0.200765
C  2.465642 -1.26507 -0.618802
C  3.053255 -1.321481 0.640216
C  2.611684 -0.104776 -1.368148
C  -1.088936 0.625071 -1.100111
C  3.767608 -0.247856 1.1436
C  3.327666 0.976962 -0.881817
C  -2.051379 -3.427153 2.327084
C  -0.804141 1.642505 -0.186027
C  -1.983959 0.908647 -2.130374
C  3.898786 0.899521 0.376474
C  -1.393422 2.892596 -0.290339
C  -2.590013 2.14597 -2.239697
C  -2.28836 3.136061 -1.317144
C  -3.276999 -4.484346 1.029266
H  -1.321331 -0.941082 1.753955
H  -2.573896 -0.769683 0.523866
H  1.319087 -2.229492 -2.16435
H  2.312886 -3.3284 -1.215617
H  2.942543 -2.211689 1.247599
H  2.146016 -0.034246 -2.342261
H  4.220111 -0.301375 2.124079
H  3.42654 1.877286 -1.471945
H  -1.438135 -3.089563 3.148647
H  -2.200815 0.13363 -2.853201
H  -1.15324 3.664674 0.426856
H  -3.288619 2.340632 -3.04106
H  -3.895143 -5.267535 0.619842
totalener: -2653.51204068 hartree
nucrepener: 2751.76628774 hartree
electener: -5405.27832842 hartree
oneelecener: -9118.97915465 hartree
twoeener: 3713.70082623 hartree
kineticenergy: 2647.23919154 hartree
xcener: -168.236614430315 hartree
chargesum: 0.0000000
charge: -0.073531 -0.080735 -0.070547 -0.056212 0.054176 -0.273044 -0.293129 -0.326633 -0.081867 -0.069476 0.169981 0.087879 -0.208169 -0.188218 0.144683 -0.108317 -0.107704 0.062181 -0.025152 -0.215984 0.065699 -0.083595 -0.073469 0.054736 0.070044 0.117998 0.137898 0.115533 0.139930 0.112209 0.111744 0.122224 0.121138 0.141984 0.125693 0.120537 0.125091 0.134424
qa: -0.0735 -0.0807 -0.0705 -0.0562 0.0542 -0.2730 -0.2931 -0.3266 -0.0819 -0.0695 0.1700 0.0879 -0.2082 -0.1882 0.1447 -0.1083 -0.1077 0.0622 -0.0252 -0.2160 0.0657 -0.0836 -0.0735 0.0547 0.0700 0.1180 0.1379 0.1155 0.1399 0.1122 0.1117 0.1222 0.1211 0.1420 0.1257 0.1205 0.1251 0.1344
va: 1.2548 1.2245 1.2334 2.4079 3.3675 2.9471 2.8514 3.0616 3.9122 3.8469 3.9245 3.5451 4.0538 3.9753 3.7132 3.9761 3.9644 4.0663 3.9937 4.0481 3.9196 3.9991 3.9697 3.9396 4.0536 1.0094 1.0043 1.0329 0.9995 1.0207 1.0188 1.0116 1.0109 1.0009 1.0197 1.0196 1.0102 1.0003
dispcorr: -0.023639060 hartree
energy: -2653.535679742087
dipole: -2.36034 2.50485 0.14452 -20.57707 20.54377 -0.03329 -3.77574 3.41710 -0.35864
magnitude: 0.38809 au
magnitude: 0.98645 debye
