program: Gaussian 09
title: 000030315
version: EM64L-G09RevD.01
frameworkgroup: C1[X(C8H19N)]
method: RPBEPBE
basis: SDD
operation: Freq
keyword: #pfreq=noraman
keyword: PBEPBE/SDD
title: #p freq=noraman PBEPBE/SDD
converged: YES YES NO NO
title: Mulliken charges:
elementType: N C C C C C C C C H H H H H H H H H H H H H H H H H H H
charge: -0.288253 -0.055853 -0.356023 -0.353899 -0.367004 -0.342842 -0.691876 -0.703352 -0.690087 0.183562 0.181377 0.197454 0.204312 0.170288 0.174746 0.211549 0.231385 0.192857 0.191195 0.195511 0.203635 0.247383 0.204739 0.214930 0.209713 0.214953 0.211463 0.208136
chargesum: 0.00000
title: Mulliken charges with hydrogens summed into heavy atoms:
elementType: N C C C C C C C C
charge: -0.056868 0.127709 0.022809 0.020700 0.019291 0.041210 -0.045346 -0.073971 -0.055534
polarizability: 1.19779883e+02 -1.16957270e+00 8.67986732e+01 -1.16334166e-01 -8.29957042e-01 8.19890481e+01
1716.lowfreq: -9.0120 -0.0004 -0.0002 0.0007 3.5428 15.1638 37.1201 54.3554 71.5345
frequency: 36.7302 54.3128 71.4927 99.4406 124.3738 151.2148 188.7098 205.8810 233.6379 239.1347 250.2082 321.0336 367.8518 409.0766 469.3488 496.6210 685.3574 737.9233 801.8146 822.0608 892.9264 904.6096 918.6856 937.3861 943.9128 965.3581 1013.2865 1037.3494 1077.3152 1097.3218 1119.1995 1140.9443 1145.3952 1181.4517 1190.4916 1214.1217 1242.4118 1268.1023 1278.1377 1283.2373 1299.0116 1333.0190 1337.1188 1352.6625 1372.0367 1380.9925 1389.9248 1396.0630 1448.2250 1462.6784 1467.6829 1469.0292 1473.4188 1477.6394 1479.6407 1481.1123 1486.8106 1490.9283 1496.4460 2835.3703 2845.0680 2941.1836 2955.4714 2966.2426 2967.4336 2970.2557 2972.8791 2988.6109 2990.9301 3006.9434 3038.7906 3056.5264 3063.7483 3069.4708 3070.6886 3072.4341 3088.5882 3412.3493
redmass: 3.0386 1.7617 3.0363 2.3128 1.9420 2.1730 2.3021 1.1020 1.1227 1.2439 2.7357 2.7174 2.4079 2.0716 2.5338 3.4396 1.2783 1.0730 1.1399 2.6334 1.8020 1.3207 1.2278 1.2095 1.5170 1.6763 2.6457 3.1045 2.1799 1.4782 2.0066 2.3813 3.5619 1.7945 1.9856 1.4867 1.2904 1.2425 1.1514 1.0801 1.3113 1.4417 1.4096 1.5609 1.2364 1.3814 1.2174 1.2892 1.2107 1.0575 1.0692 1.0507 1.0658 1.0426 1.0572 1.0697 1.0760 1.0547 1.0876 1.0712 1.0707 1.0822 1.0640 1.0358 1.0604 1.0370 1.0364 1.0873 1.0842 1.0979 1.1014 1.0991 1.0986 1.1006 1.0991 1.0995 1.0991 1.0737
irintensity: 0.0750 0.2554 0.1182 0.2570 2.2855 1.8793 0.4245 0.5174 0.0481 0.1265 0.0661 1.6807 1.1003 1.2267 3.2176 0.6079 90.7255 11.4555 0.4574 1.3861 7.4798 1.3675 4.0249 3.1558 1.3819 3.5717 0.6394 4.5941 3.7190 33.9347 4.5353 20.9369 35.8376 5.0794 3.9816 1.1838 1.8532 0.4598 1.7027 0.5672 3.7389 3.6469 0.7619 4.7855 23.0932 18.5117 4.5779 11.1038 29.2756 5.9547 1.3133 0.0222 2.4509 11.7333 11.5025 8.1415 6.8011 18.1311 9.8696 46.3815 195.5401 20.5506 9.9016 35.5259 58.0474 36.1407 33.3408 5.2701 84.4046 1.5655 49.3785 16.7591 79.4496 91.0703 56.5514 55.9605 25.2468 2.6265
temp: 298.150 k
press: 1.00000 atm
elementType: 7 6 6 6 6 6 6 6 6 1 1 1 1 1 1 1 1 1 1 1 1 1 1 1 1 1 1 1
symmnumber: 1
zpe: 676041.4 jmol-1
zpe.correction: 0.257491 hartree
zpe.thermalcorrener: 0.270087 hartree
zpe.thermalcorrenthalpy: 0.271031 hartree
zpe.thermalcorrgfe: 0.218181 hartree
zpe.sumelectzpe: -370.208510 hartree
zpe.sumelectthermal: -370.195914 hartree
zpe.sumelectthermalent: -370.194969 hartree
zpe.sumelectthermalfe: -370.247820 hartree
dipole: -0.2581 -0.8809 -0.5468
dipole: 1.0684
quadrupole: -59.7274 -61.5813 -57.6584
quadrupole: -0.1878 -0.6120 -0.2295
quadrupole: -0.0717 -1.9256 1.9973 -0.1878 -0.6120 -0.2295
hfenergy: -370.4660007 hartree
pointgroup: C01 [X(C8H19N1)]
dipole: 0.1005331 0.3387877 -0.2276126 debye
polarizability: 119.7752018|-1.227497|86.8547002|-0.1255596|0.6725223|81.9377022 unknown
InChI: InChI=1S/C8H19N/c1-4-5-6-9-7-8(2)3/h8-9H,4-7H2,1-3H3
charge 0 multiplicity 1
28 atoms
N  -0.274839 -0.047709 -0.25424
C  -2.781271 -0.124493 -0.307804
C  -1.517559 0.652769 0.13773
C  0.975132 0.577005 0.231079
C  2.211607 -0.226492 -0.21637
C  3.541923 0.388129 0.274091
C  -2.881736 -1.487736 0.412772
C  -4.048587 0.731757 -0.080453
C  4.776671 -0.421744 -0.176749
H  -2.687898 -0.315674 -1.40023
H  -1.570448 1.696449 -0.268008
H  -1.521591 0.744143 1.243611
H  0.934272 0.601139 1.339003
H  1.087575 1.641364 -0.10459
H  2.228265 -0.289843 -1.325931
H  2.112066 -1.264596 0.156531
H  -0.241958 -0.196171 -1.27419
H  3.526298 0.453922 1.381239
H  3.626054 1.429746 -0.09817
H  -3.079213 -1.339322 1.492672
H  -3.703271 -2.101965 -0.00062
H  -1.932654 -2.042289 0.313154
H  -4.168111 0.973139 0.993771
H  -4.956327 0.190252 -0.404683
H  -4.001154 1.685581 -0.639524
H  5.715441 0.032922 0.189554
H  4.730569 -1.458934 0.205371
H  4.834547 -0.474349 -1.280516
