program: Orca
programVersion: 4.2.1
elementType: Cl Cl Cl S N N N N C C C C C C C C C C C C C C C C C H H H H H H H H H H H H H
charge: 0
multiplicity: 1
keywords: wb97x-d3
keywords: def2-TZVPP
keywords: def2/J RIJCOSX GRIDX6 NOFINALGRIDX
keywords: grid4 nofinalgrid
keywords: scfconv7
keywords: smallprint printgap noloewdin
keywords: NOSOSCF
formula: C17H13Cl3N4S
InChI: InChI=1S/C17H13Cl3N4S/c18-13-3-1-12(2-4-13)9-25-17(8-24-11-21-10-22-24)23-16-6-5-14(19)7-15(16)20/h1-7,10-11H,8-9H2
38 atoms
Cl -1.737142 -0.297321 -3.967882
Cl 3.20339 1.770573 3.391305
Cl -3.683371 4.109925 -1.601839
S  0.799926 -3.009545 -0.76698
N  -0.935833 -1.960466 1.650079
N  -0.313331 -0.727999 -1.449784
N  -0.508934 -0.802646 2.162754
N  -0.000232 -2.496688 3.535203
C  -1.495333 -2.014647 0.325124
C  2.271392 -2.011643 -1.173439
C  -0.418188 -1.736021 -0.705503
C  2.576224 -1.054498 -0.062589
C  2.388365 0.312094 -0.225632
C  2.992505 -1.528185 1.178369
C  -1.158021 0.375636 -1.423209
C  2.591621 1.190545 0.828883
C  3.205068 -0.665465 2.236971
C  -0.609247 -2.964042 2.477575
C  -1.848436 0.724824 -2.586091
C  -1.259844 1.218931 -0.318334
C  2.990702 0.692921 2.056268
C  -2.631776 1.863682 -2.645002
C  -2.03144 2.36775 -0.368725
C  -2.715335 2.682839 -1.530607
C  0.039931 -1.169919 3.293615
H  -2.313805 -1.300594 0.240363
H  -1.90388 -3.015151 0.169987
H  2.103767 -1.506558 -2.122986
H  3.068274 -2.74373 -1.314303
H  2.063847 0.70081 -1.182112
H  3.1276 -2.591671 1.333082
H  2.430267 2.251067 0.694243
H  3.518393 -1.046466 3.198977
H  -0.835506 -3.998511 2.269412
H  -0.726225 0.964619 0.588407
H  -3.166484 2.107548 -3.551893
H  -2.09865 3.011202 0.497192
H  0.484304 -0.45323 3.966308
totalener: -2653.50987555 hartree
nucrepener: 2790.35698390 hartree
electener: -5443.86685946 hartree
oneelecener: -9196.46122602 hartree
twoeener: 3752.59436656 hartree
kineticenergy: 2647.23561052 hartree
xcener: -168.235038539418 hartree
chargesum: -0.0000000
charge: -0.059121 -0.083138 -0.073979 -0.084884 0.136028 -0.287298 -0.319893 -0.321479 -0.171598 -0.093186 0.209184 0.039481 -0.158889 -0.183666 0.199819 -0.129105 -0.118184 0.052925 -0.067239 -0.221527 0.086332 -0.085539 -0.109197 0.060820 0.071673 0.145810 0.133641 0.122713 0.138553 0.131709 0.113329 0.123096 0.131054 0.140085 0.161995 0.113805 0.126175 0.129696
qa: -0.0591 -0.0831 -0.0740 -0.0849 0.1360 -0.2873 -0.3199 -0.3215 -0.1716 -0.0932 0.2092 0.0395 -0.1589 -0.1837 0.1998 -0.1291 -0.1182 0.0529 -0.0672 -0.2215 0.0863 -0.0855 -0.1092 0.0608 0.0717 0.1458 0.1336 0.1227 0.1386 0.1317 0.1133 0.1231 0.1311 0.1401 0.1620 0.1138 0.1262 0.1297
va: 1.2689 1.2242 1.2299 2.3239 3.2645 2.9448 2.8395 3.0467 3.9901 3.8591 3.8404 3.6099 3.9534 3.9855 3.6149 3.9901 3.9212 4.0777 4.0266 3.9502 3.8799 3.9852 4.0448 3.9154 4.0540 0.9969 1.0007 1.0346 0.9994 1.0088 1.0182 1.0124 1.0092 1.0036 1.0302 1.0247 1.0115 1.0061
dispcorr: -0.026464510 hartree
energy: -2653.536340064701
dipole: 8.59855 -8.70911 -0.11056 -14.37704 13.39719 -0.97985 7.43109 -7.83997 -0.40888
magnitude: 1.06748 au
magnitude: 2.71332 debye
