program: Orca
programVersion: 4.2.1
elementType: Cl Cl Cl S N N N N C C C C C C C C C C C C C C C C C H H H H H H H H H H H H H
charge: 0
multiplicity: 1
keywords: wb97x-d3
keywords: def2-TZVPP
keywords: def2/J RIJCOSX GRIDX6 NOFINALGRIDX
keywords: grid4 nofinalgrid
keywords: scfconv7
keywords: smallprint printgap noloewdin
keywords: NOSOSCF
formula: C17H13Cl3N4S
InChI: InChI=1S/C17H13Cl3N4S/c18-13-3-1-12(2-4-13)9-25-17(8-24-11-21-10-22-24)23-16-6-5-14(19)7-15(16)20/h1-7,10-11H,8-9H2
38 atoms
Cl -1.004826 1.7227 3.806754
Cl 2.674138 -0.046042 -4.230978
Cl -3.435395 4.544504 -0.059937
S  0.979618 -2.373556 1.942829
N  -1.24131 -2.52742 -0.272786
N  -0.032861 0.030315 1.620574
N  -0.914577 -1.826869 -1.362009
N  -0.715972 -4.021618 -1.758187
C  -1.517069 -1.859634 0.971358
C  2.47693 -1.386168 1.617662
C  -0.257462 -1.201286 1.501294
C  2.580285 -1.039019 0.163895
C  2.447053 0.274886 -0.266152
C  2.760422 -2.038431 -0.788084
C  -0.894783 1.037089 1.203043
C  2.48218 0.590311 -1.616747
C  2.802792 -1.739892 -2.137195
C  -1.102547 -3.837532 -0.523504
C  -1.379231 1.95116 2.14068
C  -1.207624 1.24169 -0.139613
C  2.654694 -0.422077 -2.544044
C  -2.165876 3.024388 1.761422
C  -1.985345 2.317442 -0.533264
C  -2.462239 3.201892 0.419576
C  -0.613176 -2.76123 -2.228764
H  -1.870772 -2.605881 1.685599
H  -2.310882 -1.126859 0.830456
H  3.299508 -2.024397 1.944744
H  2.462376 -0.502245 2.252922
H  2.299882 1.065519 0.457744
H  2.84521 -3.072308 -0.476158
H  2.367505 1.615233 -1.941123
H  2.938729 -2.525343 -2.867624
H  -1.294007 -4.603888 0.211929
H  -0.832412 0.54385 -0.876869
H  -2.539136 3.713245 2.505735
H  -2.217814 2.461888 -1.57892
H  -0.306254 -2.523442 -3.234987
totalener: -2653.51066550 hartree
nucrepener: 2781.05279072 hartree
electener: -5434.56345622 hartree
oneelecener: -9177.85420433 hartree
twoeener: 3743.29074811 hartree
kineticenergy: 2647.23420313 hartree
xcener: -168.234079700468 hartree
chargesum: -0.0000000
charge: -0.059990 -0.082482 -0.074038 -0.081339 0.133789 -0.285434 -0.321576 -0.321628 -0.167927 -0.086452 0.203624 0.062662 -0.176443 -0.193137 0.202996 -0.121585 -0.133936 0.055678 -0.078366 -0.223724 0.095234 -0.077852 -0.102047 0.054457 0.075319 0.133286 0.145097 0.138732 0.121492 0.127602 0.113767 0.124216 0.128231 0.140572 0.161257 0.113830 0.126941 0.129177
qa: -0.0600 -0.0825 -0.0740 -0.0813 0.1338 -0.2854 -0.3216 -0.3216 -0.1679 -0.0865 0.2036 0.0627 -0.1764 -0.1931 0.2030 -0.1216 -0.1339 0.0557 -0.0784 -0.2237 0.0952 -0.0779 -0.1020 0.0545 0.0753 0.1333 0.1451 0.1387 0.1215 0.1276 0.1138 0.1242 0.1282 0.1406 0.1613 0.1138 0.1269 0.1292
va: 1.2679 1.2249 1.2298 2.3354 3.2706 2.9399 2.8388 3.0554 3.9856 3.8548 3.8499 3.5773 3.9689 3.9973 3.6063 3.9758 3.9487 4.0731 4.0292 3.9567 3.8926 3.9771 4.0329 3.9225 4.0495 1.0018 0.9965 0.9995 1.0345 1.0124 1.0196 1.0111 1.0094 1.0030 1.0284 1.0246 1.0108 1.0042
dispcorr: -0.025812680 hartree
energy: -2653.536478178931
dipole: 7.09733 -7.12766 -0.03033 -17.04421 16.39205 -0.65216 -0.57845 1.45561 0.87716
magnitude: 1.09345 au
magnitude: 2.77934 debye
