program: Orca
programVersion: 4.2.1
elementType: Cl Cl Cl S N N N N C C C C C C C C C C C C C C C C C H H H H H H H H H H H H H
charge: 0
multiplicity: 1
keywords: wb97x-d3
keywords: def2-TZVPP
keywords: def2/J RIJCOSX GRIDX6 NOFINALGRIDX
keywords: grid4 nofinalgrid
keywords: scfconv7
keywords: smallprint printgap noloewdin
keywords: NOSOSCF
formula: C17H13Cl3N4S
InChI: InChI=1S/C17H13Cl3N4S/c18-13-3-1-12(2-4-13)9-25-17(8-24-11-21-10-22-24)23-16-6-5-14(19)7-15(16)20/h1-7,10-11H,8-9H2
38 atoms
Cl 0.315104 1.900278 -1.623097
Cl 5.975165 -0.477907 -0.866059
Cl -3.76586 5.095385 -0.233953
S  -0.627374 -0.210956 1.470729
N  -1.023216 -3.317262 0.310023
N  -1.566312 -0.328093 -1.006992
N  -0.38554 -4.030999 1.243435
N  -2.529892 -4.664581 1.105301
C  -0.360184 -2.293557 -0.459044
C  0.815808 -1.086344 2.152896
C  -0.879312 -0.917057 -0.124489
C  2.088797 -0.915713 1.37487
C  2.495646 0.325717 0.895882
C  2.902412 -2.019967 1.143475
C  -2.06828 0.953431 -0.782237
C  3.689031 0.46551 0.209585
C  4.101221 -1.894224 0.457231
C  -2.303286 -3.709217 0.241533
C  -1.304063 2.085952 -1.061652
C  -3.370434 1.1352 -0.328622
C  4.488258 -0.647836 -0.004663
C  -1.820937 3.359532 -0.899319
C  -3.900174 2.401311 -0.154553
C  -3.11926 3.508721 -0.441341
C  -1.327849 -4.824037 1.694135
H  -0.537547 -2.453394 -1.52214
H  0.709124 -2.380223 -0.278885
H  0.584807 -2.139606 2.306251
H  0.91091 -0.63732 3.144938
H  1.865611 1.193752 1.040964
H  2.59096 -2.997401 1.493464
H  3.995304 1.434136 -0.160446
H  4.724235 -2.759951 0.280448
H  -3.015201 -3.276295 -0.444799
H  -3.975447 0.263823 -0.11621
H  -1.21225 4.223848 -1.123659
H  -4.912924 2.523831 0.202201
H  -1.139583 -5.546728 2.472267
totalener: -2653.51222794 hartree
nucrepener: 2699.76956202 hartree
electener: -5353.28178996 hartree
oneelecener: -9014.61902278 hartree
twoeener: 3661.33723282 hartree
kineticenergy: 2647.22699904 hartree
xcener: -168.231273085383 hartree
chargesum: -0.0000000
charge: -0.069315 -0.075046 -0.073170 -0.036990 0.111357 -0.236582 -0.346238 -0.329497 -0.102133 -0.078184 0.065556 0.006894 -0.206132 -0.206204 0.155792 -0.091644 -0.102828 0.051913 -0.008182 -0.171332 0.068802 -0.104388 -0.098314 0.061031 0.087552 0.136258 0.160754 0.131957 0.139397 0.123034 0.136137 0.126004 0.126838 0.152766 0.118851 0.115390 0.124543 0.135354
qa: -0.0693 -0.0750 -0.0732 -0.0370 0.1114 -0.2366 -0.3462 -0.3295 -0.1021 -0.0782 0.0656 0.0069 -0.2061 -0.2062 0.1558 -0.0916 -0.1028 0.0519 -0.0082 -0.1713 0.0688 -0.1044 -0.0983 0.0610 0.0876 0.1363 0.1608 0.1320 0.1394 0.1230 0.1361 0.1260 0.1268 0.1528 0.1189 0.1154 0.1245 0.1354
va: 1.2536 1.2313 1.2302 2.3946 3.2934 2.9903 2.8285 3.0655 3.8066 3.8524 3.9826 3.6352 4.0160 3.9595 3.8556 3.9826 3.9999 4.0693 4.0164 4.0315 3.9515 4.0380 4.0001 3.9323 4.0221 1.0239 1.0009 1.0427 0.9938 1.0282 1.0239 1.0110 1.0105 1.0021 1.0137 1.0220 1.0102 0.9992
dispcorr: -0.022907457 hartree
energy: -2653.535135395718
dipole: -2.73775 2.90372 0.16597 -20.38502 20.16320 -0.22182 9.90773 -9.51862 0.38910
magnitude: 0.47765 au
magnitude: 1.21410 debye
