program: Orca
programVersion: 4.2.1
elementType: Cl Cl Cl S N N N N C C C C C C C C C C C C C C C C C H H H H H H H H H H H H H
charge: 0
multiplicity: 1
keywords: wb97x-d3
keywords: def2-TZVPP
keywords: def2/J RIJCOSX GRIDX6 NOFINALGRIDX
keywords: grid4 nofinalgrid
keywords: scfconv7
keywords: smallprint printgap noloewdin
keywords: NOSOSCF
formula: C17H13Cl3N4S
InChI: InChI=1S/C17H13Cl3N4S/c18-13-3-1-12(2-4-13)9-25-17(8-24-11-21-10-22-24)23-16-6-5-14(19)7-15(16)20/h1-7,10-11H,8-9H2
38 atoms
Cl -2.754002 -0.418441 -2.195867
Cl 5.242738 2.015017 1.739113
Cl -3.026892 4.808231 -1.003429
S  0.460699 -2.765293 0.212224
N  -2.222291 -2.611382 1.356132
N  -0.202841 -0.359533 -0.607184
N  -1.905581 -3.34633 2.427828
N  -3.287423 -4.481343 1.074373
C  -1.660318 -1.30714 1.149359
C  1.860917 -2.243156 -0.821137
C  -0.510979 -1.310766 0.161149
C  2.703372 -1.179506 -0.18054
C  3.331125 -1.407605 1.039807
C  2.878203 0.053661 -0.796409
C  -0.913874 0.832576 -0.661676
C  4.114164 -0.433134 1.634548
C  3.661803 1.039335 -0.216051
C  -3.04518 -3.308416 0.554899
C  -2.091417 0.964478 -1.398764
C  -0.403375 1.971491 -0.041073
C  4.273878 0.789786 1.000839
C  -2.744326 2.181283 -1.510041
C  -1.046163 3.191909 -0.136348
C  -2.217185 3.29058 -0.871876
C  -2.567439 -4.456264 2.217142
H  -1.293182 -0.952221 2.113049
H  -2.438096 -0.619374 0.818616
H  1.483586 -1.924588 -1.791951
H  2.432336 -3.161222 -0.97279
H  3.198691 -2.356209 1.546055
H  2.387833 0.256342 -1.739366
H  4.596081 -0.62172 2.583741
H  3.790015 1.994575 -0.706192
H  -3.429822 -2.918792 -0.375404
H  0.522438 1.885287 0.512937
H  -3.655367 2.25708 -2.086436
H  -0.635965 4.062189 0.356191
H  -2.533812 -5.278191 2.914488
totalener: -2653.51224926 hartree
nucrepener: 2688.38157035 hartree
electener: -5341.89381961 hartree
oneelecener: -8991.74026631 hartree
twoeener: 3649.84644670 hartree
kineticenergy: 2647.22817056 hartree
xcener: -168.232991094942 hartree
chargesum: 0.0000000
charge: -0.072108 -0.078932 -0.068943 -0.035122 0.072743 -0.290005 -0.297192 -0.327005 -0.129091 -0.064364 0.161901 0.065427 -0.185774 -0.191216 0.175139 -0.113189 -0.134359 0.071207 -0.089186 -0.183473 0.078127 -0.076880 -0.097772 0.054037 0.071803 0.138532 0.151890 0.114664 0.141014 0.117617 0.117867 0.124682 0.126722 0.137381 0.132712 0.119456 0.127157 0.134533
qa: -0.0721 -0.0789 -0.0689 -0.0351 0.0727 -0.2900 -0.2972 -0.3270 -0.1291 -0.0644 0.1619 0.0654 -0.1858 -0.1912 0.1751 -0.1132 -0.1344 0.0712 -0.0892 -0.1835 0.0781 -0.0769 -0.0978 0.0540 0.0718 0.1385 0.1519 0.1147 0.1410 0.1176 0.1179 0.1247 0.1267 0.1374 0.1327 0.1195 0.1272 0.1345
va: 1.2561 1.2279 1.2344 2.4228 3.3064 2.9688 2.8487 3.0682 3.9114 3.8290 3.9310 3.5724 4.0369 3.9576 3.7260 3.9925 3.9570 4.0614 3.9798 4.0109 3.9268 3.9983 4.0020 3.9414 4.0406 1.0130 0.9870 1.0368 0.9991 1.0177 1.0173 1.0108 1.0100 1.0142 1.0074 1.0205 1.0104 1.0001
dispcorr: -0.022332924 hartree
energy: -2653.534582186358
dipole: 5.59171 -5.19687 0.39484 -14.77786 15.13150 0.35363 4.33381 -4.59496 -0.26115
magnitude: 0.59089 au
magnitude: 1.50192 debye
