program: Orca
programVersion: 4.2.1
elementType: Cl Cl Cl S N N N N C C C C C C C C C C C C C C C C C H H H H H H H H H H H H H
charge: 0
multiplicity: 1
keywords: wb97x-d3
keywords: def2-TZVPP
keywords: def2/J RIJCOSX GRIDX6 NOFINALGRIDX
keywords: grid4 nofinalgrid
keywords: scfconv7
keywords: smallprint printgap noloewdin
keywords: NOSOSCF
formula: C17H13Cl3N4S
InChI: InChI=1S/C17H13Cl3N4S/c18-13-3-1-12(2-4-13)9-25-17(8-24-11-21-10-22-24)23-16-6-5-14(19)7-15(16)20/h1-7,10-11H,8-9H2
38 atoms
Cl 0.144081 2.571674 0.519858
Cl 6.002807 0.042936 1.649569
Cl -3.801686 4.387814 -2.631535
S  -0.324643 -0.789322 -1.290335
N  -0.884912 -3.034388 1.158897
N  -1.581814 0.159023 0.838922
N  -0.182038 -4.070774 0.690929
N  -2.325088 -4.651551 0.989871
C  -0.286113 -1.744684 1.399561
C  1.152497 -1.849678 -1.351101
C  -0.774161 -0.714418 0.41064
C  2.343829 -1.344706 -0.587789
C  3.119753 -2.246719 0.133511
C  2.715019 -0.003924 -0.598121
C  -2.081898 1.142547 -0.014425
C  4.248779 -1.829286 0.82166
C  3.839008 0.426393 0.085799
C  -2.16346 -3.399109 1.329952
C  -1.391816 2.335698 -0.226109
C  -3.316212 0.978572 -0.634671
C  4.603225 -0.49118 0.791106
C  -1.916868 3.337381 -1.024355
C  -3.851754 1.966605 -1.441216
C  -3.146092 3.143328 -1.631742
C  -1.086183 -5.016948 0.604606
H  0.794376 -1.8650 1.371149
H  -0.561889 -1.389527 2.391914
H  1.371505 -1.879097 -2.421714
H  0.898824 -2.866302 -1.054032
H  2.831163 -3.290481 0.171551
H  2.111487 0.72105 -1.128952
H  4.842282 -2.539268 1.380727
H  4.117969 1.470885 0.073724
H  -2.921741 -2.726878 1.701969
H  -3.863469 0.059281 -0.473052
H  -1.36666 4.255648 -1.173216
H  -4.810653 1.820322 -1.917885
H  -0.841012 -6.007687 0.25599
totalener: -2653.51245650 hartree
nucrepener: 2693.64235961 hartree
electener: -5347.15481612 hartree
oneelecener: -9002.35764844 hartree
twoeener: 3655.20283232 hartree
kineticenergy: 2647.22629132 hartree
xcener: -168.231492501341 hartree
chargesum: -0.0000000
charge: -0.070241 -0.074539 -0.073017 -0.034215 0.112096 -0.241739 -0.346816 -0.330079 -0.106379 -0.076559 0.070121 -0.016140 -0.193021 -0.179389 0.155718 -0.109680 -0.099288 0.051545 -0.006733 -0.172067 0.071060 -0.104969 -0.099743 0.063018 0.087504 0.164159 0.136345 0.139063 0.132440 0.131563 0.119715 0.126880 0.125562 0.154058 0.118205 0.115931 0.124604 0.135025
qa: -0.0702 -0.0745 -0.0730 -0.0342 0.1121 -0.2417 -0.3468 -0.3301 -0.1064 -0.0766 0.0701 -0.0161 -0.1930 -0.1794 0.1557 -0.1097 -0.0993 0.0515 -0.0067 -0.1721 0.0711 -0.1050 -0.0997 0.0630 0.0875 0.1642 0.1363 0.1391 0.1324 0.1316 0.1197 0.1269 0.1256 0.1541 0.1182 0.1159 0.1246 0.1350
va: 1.2520 1.2322 1.2304 2.4030 3.2927 2.9900 2.8304 3.0658 3.8167 3.8499 3.9790 3.6726 3.9610 4.0033 3.8565 4.0021 3.9951 4.0685 4.0156 4.0321 3.9507 4.0357 4.0006 3.9311 4.0240 0.9978 1.0235 0.9934 1.0410 1.0249 1.0334 1.0105 1.0114 1.0025 1.0138 1.0212 1.0101 0.9995
dispcorr: -0.022757099 hartree
energy: -2653.535213601760
dipole: -1.31529 1.56241 0.24712 -22.44710 22.07640 -0.37070 0.50688 -0.74346 -0.23659
magnitude: 0.50445 au
magnitude: 1.28220 debye
