program: Orca
programVersion: 4.2.1
elementType: Cl Cl Cl S N N N N C C C C C C C C C C C C C C C C C H H H H H H H H H H H H H
charge: 0
multiplicity: 1
keywords: wb97x-d3
keywords: def2-TZVPP
keywords: def2/J RIJCOSX GRIDX6 NOFINALGRIDX
keywords: grid4 nofinalgrid
keywords: scfconv7
keywords: smallprint printgap noloewdin
keywords: NOSOSCF
formula: C17H13Cl3N4S
InChI: InChI=1S/C17H13Cl3N4S/c18-13-3-1-12(2-4-13)9-25-17(8-24-11-21-10-22-24)23-16-6-5-14(19)7-15(16)20/h1-7,10-11H,8-9H2
38 atoms
Cl -2.399637 -0.40376 -3.156104
Cl 3.553176 1.828688 3.218983
Cl -2.998946 4.604646 -1.327373
S  0.544459 -3.01875 -0.715062
N  -1.691579 -2.342811 1.223023
N  -0.074562 -0.519717 -1.226344
N  -1.958582 -3.612734 1.537674
N  -1.042308 -2.545687 3.28421
C  -1.853305 -1.85091 -0.118796
C  2.151526 -2.22304 -0.997029
C  -0.49902 -1.610274 -0.757488
C  2.506209 -1.222282 0.066234
C  2.397814 -1.532263 1.418143
C  2.950114 0.045033 -0.290613
C  -0.816703 0.653468 -1.235531
C  2.717716 -0.600544 2.392205
C  3.285301 0.985298 0.671261
C  -1.133579 -1.721591 2.273697
C  -1.889927 0.865792 -2.102398
C  -0.432108 1.705143 -0.403899
C  3.161523 0.656745 2.011539
C  -2.559617 2.078618 -2.140159
C  -1.100382 2.914904 -0.4179
C  -2.162672 3.096468 -1.29084
C  -1.560157 -3.688149 2.783379
H  -2.437185 -0.930186 -0.110619
H  -2.414111 -2.598271 -0.679131
H  2.159672 -1.766533 -1.985797
H  2.859228 -3.055148 -1.010403
H  2.034966 -2.505425 1.725255
H  3.019929 0.313782 -1.336958
H  2.618725 -0.852151 3.439081
H  3.627744 1.968541 0.379191
H  -0.81486 -0.689889 2.252491
H  0.415003 1.557808 0.254171
H  -3.38574 2.219824 -2.822597
H  -0.792957 3.713861 0.24208
H  -1.650144 -4.598298 3.354894
totalener: -2653.51045262 hartree
nucrepener: 2759.66404269 hartree
electener: -5413.17449531 hartree
oneelecener: -9134.29280675 hartree
twoeener: 3721.11831144 hartree
kineticenergy: 2647.22762398 hartree
xcener: -168.232728015123 hartree
chargesum: 0.0000000
charge: -0.062761 -0.076469 -0.067961 -0.041754 0.091670 -0.260415 -0.291967 -0.329386 -0.114799 -0.068872 0.109389 0.108545 -0.237123 -0.191676 0.176959 -0.122159 -0.147344 0.045134 -0.057349 -0.163078 0.097506 -0.098394 -0.136848 0.074354 0.067496 0.148405 0.147456 0.110751 0.137162 0.129645 0.112803 0.135313 0.127182 0.142937 0.125631 0.118363 0.126833 0.134821
qa: -0.0628 -0.0765 -0.0680 -0.0418 0.0917 -0.2604 -0.2920 -0.3294 -0.1148 -0.0689 0.1094 0.1085 -0.2371 -0.1917 0.1770 -0.1222 -0.1473 0.0451 -0.0573 -0.1631 0.0975 -0.0984 -0.1368 0.0744 0.0675 0.1484 0.1475 0.1108 0.1372 0.1296 0.1128 0.1353 0.1272 0.1429 0.1256 0.1184 0.1268 0.1348
va: 1.2645 1.2302 1.2359 2.4002 3.3400 3.0029 2.8559 3.0402 3.8892 3.8493 3.9619 3.5448 3.9988 3.9581 3.7422 3.9693 3.9474 4.0677 3.9973 3.9698 3.8834 4.0219 4.0619 3.9233 4.0401 0.9938 1.0146 1.0349 0.9983 1.0185 1.0144 1.0090 1.0112 1.0032 1.0120 1.0208 1.0120 1.0000
dispcorr: -0.024821442 hartree
energy: -2653.535274063737
dipole: 8.29190 -7.98370 0.30821 -14.15601 14.19994 0.04394 4.70513 -5.49722 -0.79208
magnitude: 0.85107 au
magnitude: 2.16324 debye
