program: Orca
programVersion: 4.2.1
elementType: Cl Cl Cl S N N N N C C C C C C C C C C C C C C C C C H H H H H H H H H H H H H
charge: 0
multiplicity: 1
keywords: wb97x-d3
keywords: def2-TZVPP
keywords: def2/J RIJCOSX GRIDX6 NOFINALGRIDX
keywords: grid4 nofinalgrid
keywords: scfconv7
keywords: smallprint printgap noloewdin
keywords: NOSOSCF
formula: C17H13Cl3N4S
InChI: InChI=1S/C17H13Cl3N4S/c18-13-3-1-12(2-4-13)9-25-17(8-24-11-21-10-22-24)23-16-6-5-14(19)7-15(16)20/h1-7,10-11H,8-9H2
38 atoms
Cl -2.859483 -0.582738 -1.996177
Cl 5.505461 2.175876 1.027774
Cl -3.204689 4.705524 -1.137199
S  0.613986 -2.67294 0.262232
N  -1.982329 -2.484399 1.614842
N  -0.184403 -0.342468 -0.650994
N  -1.552282 -3.180578 2.672622
N  -3.074333 -4.357498 1.520679
C  -1.441936 -1.19275 1.299207
C  1.894257 -2.205208 -0.941142
C  -0.392085 -1.243786 0.206754
C  2.791045 -1.108366 -0.448453
C  2.865941 0.10544 -1.120576
C  3.572047 -1.288257 0.688945
C  -0.935289 0.823968 -0.721607
C  3.701468 1.118888 -0.675867
C  4.40925 -0.28609 1.147654
C  -2.887816 -3.205933 0.934048
C  -2.17696 0.871287 -1.356847
C  -0.411407 2.017293 -0.227268
C  4.467522 0.916648 0.459812
C  -2.878301 2.058409 -1.490908
C  -1.101221 3.209685 -0.346237
C  -2.334926 3.223802 -0.978557
C  -2.233602 -4.294437 2.576031
H  -0.983381 -0.799461 2.207198
H  -2.247737 -0.516349 1.015953
H  1.412795 -1.940048 -1.881395
H  2.45315 -3.128976 -1.103283
H  2.257026 0.268341 -1.999889
H  3.519547 -2.221721 1.236285
H  3.753247 2.058461 -1.208498
H  5.011992 -0.437032 2.032345
H  -3.371407 -2.848683 0.037621
H  0.561465 1.995964 0.246758
H  -3.838529 2.068626 -1.986803
H  -0.679812 4.123587 0.048135
H  -2.127287 -5.090397 3.295853
totalener: -2653.51217933 hartree
nucrepener: 2684.52875537 hartree
electener: -5338.04093470 hartree
oneelecener: -8984.02464801 hartree
twoeener: 3645.98371331 hartree
kineticenergy: 2647.22654354 hartree
xcener: -168.232373336565 hartree
chargesum: -0.0000000
charge: -0.071881 -0.079048 -0.068982 -0.033880 0.073919 -0.292121 -0.297594 -0.327720 -0.130107 -0.067186 0.163009 0.060813 -0.190200 -0.182889 0.172378 -0.132924 -0.113256 0.070022 -0.088369 -0.184601 0.077757 -0.076718 -0.095392 0.054081 0.072347 0.139526 0.151385 0.116166 0.141796 0.119607 0.117002 0.126519 0.124157 0.137234 0.133349 0.120028 0.127238 0.134534
qa: -0.0719 -0.0790 -0.0690 -0.0339 0.0739 -0.2921 -0.2976 -0.3277 -0.1301 -0.0672 0.1630 0.0608 -0.1902 -0.1829 0.1724 -0.1329 -0.1133 0.0700 -0.0884 -0.1846 0.0778 -0.0767 -0.0954 0.0541 0.0723 0.1395 0.1514 0.1162 0.1418 0.1196 0.1170 0.1265 0.1242 0.1372 0.1333 0.1200 0.1272 0.1345
va: 1.2564 1.2284 1.2342 2.4262 3.3060 2.9610 2.8479 3.0689 3.9150 3.8263 3.9299 3.5775 3.9581 4.0370 3.7295 3.9586 3.9938 4.0609 3.9789 4.0112 3.9306 3.9976 3.9986 3.9425 4.0399 1.0129 0.9869 1.0370 0.9988 1.0169 1.0174 1.0102 1.0110 1.0162 1.0079 1.0206 1.0104 1.0001
dispcorr: -0.022248663 hartree
energy: -2653.534427993628
dipole: 6.19174 -5.82543 0.36631 -14.10817 14.47641 0.36825 4.74663 -5.04458 -0.29795
magnitude: 0.59880 au
magnitude: 1.52203 debye
