program: Orca
programVersion: 4.2.1
elementType: Cl Cl Cl S N N N N C C C C C C C C C C C C C C C C C H H H H H H H H H H H H H
charge: 0
multiplicity: 1
keywords: wb97x-d3
keywords: def2-TZVPP
keywords: def2/J RIJCOSX GRIDX6 NOFINALGRIDX
keywords: grid4 nofinalgrid
keywords: scfconv7
keywords: smallprint printgap noloewdin
keywords: NOSOSCF
formula: C17H13Cl3N4S
InChI: InChI=1S/C17H13Cl3N4S/c18-13-3-1-12(2-4-13)9-25-17(8-24-11-21-10-22-24)23-16-6-5-14(19)7-15(16)20/h1-7,10-11H,8-9H2
38 atoms
Cl -2.012756 0.556104 3.353999
Cl 3.446113 1.035449 -3.820414
Cl -2.770569 4.95692 0.379595
S  0.718381 -2.649686 1.38739
N  -1.725732 -2.533001 -0.346948
N  0.13697 -0.090581 1.323023
N  -2.013347 -3.826297 -0.182034
N  -1.307957 -3.438411 -2.274694
C  -1.736697 -1.615571 0.759002
C  2.338891 -1.834763 1.346196
C  -0.324207 -1.254678 1.176139
C  2.613285 -1.129816 0.047844
C  2.412338 -1.760011 -1.176103
C  3.080138 0.178638 0.051765
C  -0.603374 1.063165 1.102999
C  2.666817 -1.101489 -2.368132
C  3.348427 0.848766 -1.131734
C  -1.293153 -2.319677 -1.599393
C  -1.597599 1.508785 1.974929
C  -0.292759 1.864048 0.004116
C  3.134819 0.203372 -2.338889
C  -2.262429 2.706315 1.761903
C  -0.957792 3.052323 -0.231013
C  -1.940774 3.469992 0.653897
C  -1.754724 -4.329537 -1.363612
H  -2.263774 -2.095454 1.583216
H  -2.288545 -0.714346 0.489565
H  3.047248 -2.650156 1.509936
H  2.421729 -1.151235 2.190016
H  2.030206 -2.772944 -1.209307
H  3.222703 0.694398 0.992772
H  2.501365 -1.601325 -3.312536
H  3.710011 1.86769 -1.113325
H  -0.984105 -1.350827 -1.962667
H  0.492883 1.537479 -0.665365
H  -3.026691 3.03108 2.453579
H  -0.7091 3.653312 -1.094284
H  -1.899367 -5.376204 -1.579302
totalener: -2653.51084483 hartree
nucrepener: 2749.78214076 hartree
electener: -5403.29298559 hartree
oneelecener: -9114.52469384 hartree
twoeener: 3711.23170825 hartree
kineticenergy: 2647.23192075 hartree
xcener: -168.233640781696 hartree
chargesum: -0.0000000
charge: -0.063036 -0.076950 -0.068086 -0.040583 0.083299 -0.262873 -0.293088 -0.326904 -0.110484 -0.071137 0.118226 0.113029 -0.236117 -0.194756 0.163758 -0.119495 -0.143933 0.043729 -0.049397 -0.158306 0.091161 -0.097099 -0.135976 0.073913 0.069165 0.145876 0.146130 0.137880 0.111436 0.128741 0.112460 0.134200 0.127336 0.143851 0.124075 0.118241 0.126553 0.135165
qa: -0.0630 -0.0770 -0.0681 -0.0406 0.0833 -0.2629 -0.2931 -0.3269 -0.1105 -0.0711 0.1182 0.1130 -0.2361 -0.1948 0.1638 -0.1195 -0.1439 0.0437 -0.0494 -0.1583 0.0912 -0.0971 -0.1360 0.0739 0.0692 0.1459 0.1461 0.1379 0.1114 0.1287 0.1125 0.1342 0.1273 0.1439 0.1241 0.1182 0.1266 0.1352
va: 1.2643 1.2294 1.2354 2.4048 3.3418 2.9982 2.8535 3.0436 3.8839 3.8470 3.9531 3.5413 4.0025 3.9637 3.7534 3.9733 3.9477 4.0663 3.9907 3.9762 3.8926 4.0190 4.0547 3.9202 4.0400 1.0136 0.9947 0.9979 1.0346 1.0207 1.0150 1.0083 1.0111 1.0027 1.0123 1.0206 1.0119 0.9997
dispcorr: -0.024348910 hartree
energy: -2653.535193739262
dipole: 7.70998 -7.33040 0.37958 -15.19435 15.47934 0.28499 -1.60188 2.25459 0.65271
magnitude: 0.80705 au
magnitude: 2.05136 debye
