program: Orca
programVersion: 4.2.1
elementType: Cl Cl Cl S N N N N C C C C C C C C C C C C C C C C C H H H H H H H H H H H H H
charge: 0
multiplicity: 1
keywords: wb97x-d3
keywords: def2-TZVPP
keywords: def2/J RIJCOSX GRIDX6 NOFINALGRIDX
keywords: grid4 nofinalgrid
keywords: scfconv7
keywords: smallprint printgap noloewdin
keywords: NOSOSCF
formula: C17H13Cl3N4S
InChI: InChI=1S/C17H13Cl3N4S/c18-13-3-1-12(2-4-13)9-25-17(8-24-11-21-10-22-24)23-16-6-5-14(19)7-15(16)20/h1-7,10-11H,8-9H2
38 atoms
Cl 0.506093 0.7343 1.33906
Cl 4.524562 2.794281 0.79963
Cl -3.746472 3.495982 -0.40753
S  1.332849 -3.242863 -0.413902
N  -2.191165 -2.100163 0.912312
N  -0.118528 -1.125445 -0.942194
N  -2.968102 -2.673042 -0.010379
N  -4.112873 -1.115535 1.127811
C  -0.81533 -2.476761 1.039183
C  2.378183 -2.296519 -1.55988
C  0.015215 -2.112462 -0.175331
C  2.914359 -1.027539 -0.96592
C  2.639201 0.19844 -1.557809
C  3.699414 -1.050881 0.181538
C  -1.007981 -0.07743 -0.755091
C  3.13648 1.377676 -1.027098
C  4.199543 0.118448 0.727848
C  -2.889364 -1.167385 1.579663
C  -0.80051 0.90093 0.219589
C  -2.080203 0.09282 -1.628615
C  3.912735 1.329978 0.117648
C  -1.632551 2.003242 0.327483
C  -2.931358 1.175214 -1.51952
C  -2.700276 2.130621 -0.542428
C  -4.109713 -2.05194 0.154708
H  -0.75398 -3.5518 1.219577
H  -0.389631 -1.974426 1.909911
H  1.808622 -2.102111 -2.467626
H  3.183096 -2.988539 -1.816814
H  2.013398 0.239227 -2.439664
H  3.916449 -1.993971 0.668524
H  2.907222 2.325844 -1.492856
H  4.808496 0.089711 1.62082
H  -2.464953 -0.564726 2.368295
H  -2.246323 -0.653763 -2.392938
H  -1.448996 2.747498 1.089431
H  -3.77025 1.277629 -2.193108
H  -4.976283 -2.286001 -0.443287
totalener: -2653.51069565 hartree
nucrepener: 2840.53098638 hartree
electener: -5494.04168203 hartree
oneelecener: -9296.87668787 hartree
twoeener: 3802.83500584 hartree
kineticenergy: 2647.24428412 hartree
xcener: -168.241687356353 hartree
chargesum: 0.0000000
charge: -0.076802 -0.079991 -0.073943 -0.059741 0.115052 -0.265544 -0.300164 -0.314777 -0.143828 -0.082083 0.179891 0.086445 -0.187643 -0.207197 0.240187 -0.109786 -0.106170 0.044588 -0.087410 -0.243587 0.068661 -0.084247 -0.074381 0.082924 0.052697 0.128284 0.132335 0.117733 0.141096 0.113851 0.111140 0.122386 0.121634 0.145683 0.122964 0.117795 0.119610 0.132338
qa: -0.0768 -0.0800 -0.0739 -0.0597 0.1151 -0.2655 -0.3002 -0.3148 -0.1438 -0.0821 0.1799 0.0864 -0.1876 -0.2072 0.2402 -0.1098 -0.1062 0.0446 -0.0874 -0.2436 0.0687 -0.0842 -0.0744 0.0829 0.0527 0.1283 0.1323 0.1177 0.1411 0.1139 0.1111 0.1224 0.1216 0.1457 0.1230 0.1178 0.1196 0.1323
va: 1.2529 1.2252 1.2301 2.3968 3.2946 2.9763 2.8267 3.0439 3.9509 3.8506 3.9395 3.5416 3.9784 4.0522 3.6217 3.9640 3.9780 4.0646 3.9591 3.9868 3.9180 3.9891 3.9836 3.9306 4.0570 1.0119 1.0071 1.0331 0.9988 1.0173 1.0207 1.0108 1.0116 1.0010 1.0248 1.0205 1.0114 1.0023
dispcorr: -0.027254684 hartree
energy: -2653.537950338149
dipole: 0.48396 0.26613 0.75009 -18.26654 17.25879 -1.00775 -6.29151 6.15344 -0.13808
magnitude: 1.26383 au
magnitude: 3.21240 debye
