program: Orca
programVersion: 4.2.1
elementType: Cl Cl O N N N C C C C C C C C C C C C C C H H H H H H H H H H H H H H H H H
charge: 0
multiplicity: 1
keywords: wb97x-d3
keywords: def2-TZVPP
keywords: def2/J RIJCOSX GRIDX6 NOFINALGRIDX
keywords: grid4 nofinalgrid
keywords: scfconv7
keywords: smallprint printgap noloewdin
keywords: NOSOSCF
formula: C14H17Cl2N3O
InChI: InChI=1S/C14H17Cl2N3O/c1-2-3-6-14(20,8-19-10-17-9-18-19)12-5-4-11(15)7-13(12)16/h4-5,7,9-10,20H,2-3,6,8H2,1H3
37 atoms
Cl 0.145667 0.647018 -2.224037
Cl -1.740394 5.057978 0.061408
O  -0.243698 -1.098247 2.027863
N  -0.743866 -3.044382 -0.020828
N  -0.067093 -3.634821 -1.011361
N  -0.341341 -5.05418 0.704432
C  -0.086846 -0.753926 0.668024
C  1.367519 -1.031772 0.245614
C  -1.095992 -1.646189 -0.073561
C  2.366426 0.019172 0.721182
C  -0.50417 0.708318 0.450646
C  3.816527 -0.402593 0.505315
C  -0.432168 1.393415 -0.764852
C  -0.998262 1.435303 1.532695
C  4.182029 -0.615158 -0.95697
C  -0.809572 2.722101 -0.8947
C  -1.381357 2.762314 1.436398
C  -0.88917 -3.897937 0.99244
C  -1.279436 3.399775 0.214888
C  0.146702 -4.830954 -0.529409
H  1.43705 -1.146369 -0.83372
H  1.642699 -2.003713 0.667412
H  -1.175351 -1.375218 -1.122148
H  -2.0831 -1.51914 0.371793
H  2.190325 0.965528 0.202246
H  2.224574 0.231774 1.786516
H  4.018035 -1.316928 1.071029
H  4.46731 0.366124 0.928815
H  0.536972 -0.821366 2.521391
H  -1.089619 0.955067 2.495187
H  3.949922 0.268535 -1.555071
H  5.247934 -0.816831 -1.069129
H  3.648451 -1.458428 -1.397377
H  -0.732376 3.217609 -1.852468
H  -1.75088 3.282343 2.308888
H  -1.41265 -3.651694 1.901478
H  0.673378 -5.580315 -1.099325
elementType: Cl O N C H
totalener: -1703.70438002 hartree
nucrepener: 1860.00484139 hartree
electener: -3563.70922141 hartree
oneelecener: -6031.62891176 hartree
twoeener: 2467.91969035 hartree
cpcmener: -0.02636584 hartree
kineticenergy: 1698.97821832 hartree
xcener: -118.930859898180 hartree
chargesum: 0.0000000
charge: -0.084171 -0.086387 -0.413201 0.097099 -0.345067 -0.420888 0.511250 -0.314887 -0.142768 -0.075420 -0.014511 -0.116508 -0.117778 -0.130880 -0.279161 -0.104905 -0.183754 0.076031 0.097406 0.061407 0.091332 0.106849 0.134610 0.140966 0.071823 0.072921 0.059216 0.074729 0.228344 0.149249 0.078968 0.096816 0.080093 0.124013 0.145382 0.168972 0.162809
qa: -0.0842 -0.0864 -0.4132 0.0971 -0.3451 -0.4209 0.5113 -0.3149 -0.1428 -0.0754 -0.0145 -0.1165 -0.1178 -0.1309 -0.2792 -0.1049 -0.1838 0.0760 0.0974 0.0614 0.0913 0.1068 0.1346 0.1410 0.0718 0.0729 0.0592 0.0747 0.2283 0.1492 0.0790 0.0968 0.0801 0.1240 0.1454 0.1690 0.1628
va: 1.2364 1.2180 2.0314 3.3665 2.8810 3.0284 3.6245 3.9005 3.7952 3.8398 3.3911 3.8968 4.0206 3.9441 3.9240 4.0348 4.0543 4.0679 3.8695 4.0460 1.0179 1.0108 1.0341 1.0110 1.0146 1.0225 1.0105 1.0068 1.0131 1.0312 1.0041 1.0045 0.9988 1.0210 1.0073 1.0056 0.9953
dispcorr: -0.020739572 hartree
energy: -1703.725119588093
dipole: 22.64929 -22.47250 0.17678 -17.53977 18.94489 1.40512 7.96266 -6.91098 1.05168
magnitude: 1.76398 au
magnitude: 4.48369 debye
