program: Orca
programVersion: 4.2.1
elementType: Cl Cl O N N N C C C C C C C C C C C C C C H H H H H H H H H H H H H H H H H
charge: 0
multiplicity: 1
keywords: wb97x-d3
keywords: def2-TZVPP
keywords: def2/J RIJCOSX GRIDX6 NOFINALGRIDX
keywords: grid4 nofinalgrid
keywords: scfconv7
keywords: smallprint printgap noloewdin
keywords: NOSOSCF
formula: C14H17Cl2N3O
InChI: InChI=1S/C14H17Cl2N3O/c1-2-3-6-14(20,8-19-10-17-9-18-19)12-5-4-11(15)7-13(12)16/h4-5,7,9-10,20H,2-3,6,8H2,1H3
37 atoms
Cl -0.091886 0.590303 -2.481712
Cl -1.66958 5.001076 0.013495
O  -0.099445 -1.12555 1.793368
N  -0.858862 -3.104845 -0.013698
N  -0.035194 -3.910589 -0.692067
N  -0.968387 -5.011359 1.02654
C  0.010496 -0.816578 0.420344
C  1.455812 -1.050722 -0.043327
C  -1.010984 -1.706689 -0.33155
C  2.477421 -0.116446 0.594856
C  -0.407967 0.646818 0.259866
C  3.900279 -0.44786 0.163477
C  -0.486663 1.328175 -0.957689
C  -0.731924 1.389033 1.396178
C  4.935189 0.447277 0.826897
C  -0.873734 2.658518 -1.042131
C  -1.11617 2.717452 1.343543
C  -1.396794 -3.772429 1.007661
C  -1.188128 3.345214 0.114809
C  -0.139028 -5.035373 -0.032922
H  1.520258 -0.975496 -1.128398
H  1.72312 -2.08698 0.189568
H  -0.934407 -1.605319 -1.409626
H  -2.020711 -1.413548 -0.044652
H  2.255747 0.921101 0.327539
H  2.41155 -0.172355 1.68549
H  3.97996 -0.35723 -0.923968
H  4.118165 -1.493968 0.398057
H  0.537997 -1.813335 2.011412
H  -0.678965 0.920212 2.36595
H  4.908101 0.345126 1.913402
H  5.945897 0.200928 0.499346
H  4.761068 1.498957 0.591835
H  -0.923229 3.14809 -2.004546
H  -1.352859 3.247157 2.25556
H  -2.104635 -3.330456 1.690192
H  0.405826 -5.916446 -0.333529
elementType: Cl O N C H
totalener: -1703.70456998 hartree
nucrepener: 1839.33881184 hartree
electener: -3543.04338181 hartree
oneelecener: -5990.15529808 hartree
twoeener: 2447.11191627 hartree
cpcmener: -0.02532764 hartree
kineticenergy: 1698.98068154 hartree
xcener: -118.930557052161 hartree
chargesum: 0.0000000
charge: -0.084957 -0.086196 -0.423224 0.119346 -0.375864 -0.421861 0.399606 -0.232503 -0.138600 -0.083804 -0.010575 -0.086482 -0.027561 -0.152581 -0.287885 -0.120713 -0.175269 0.059248 0.101448 0.074935 0.088433 0.090471 0.138111 0.140569 0.064350 0.065925 0.059699 0.060616 0.236546 0.151216 0.079772 0.091919 0.078598 0.122485 0.145561 0.175191 0.164029
qa: -0.0850 -0.0862 -0.4232 0.1193 -0.3759 -0.4219 0.3996 -0.2325 -0.1386 -0.0838 -0.0106 -0.0865 -0.0276 -0.1526 -0.2879 -0.1207 -0.1753 0.0592 0.1014 0.0749 0.0884 0.0905 0.1381 0.1406 0.0643 0.0659 0.0597 0.0606 0.2365 0.1512 0.0798 0.0919 0.0786 0.1225 0.1456 0.1752 0.1640
va: 1.2386 1.2184 2.0110 3.3639 2.8686 3.0284 3.7589 3.8338 3.7988 3.8399 3.4029 3.8815 3.9852 3.9545 3.9473 4.0472 4.0457 4.0700 3.8643 4.0281 1.0325 1.0288 1.0335 1.0047 1.0135 1.0247 1.0053 1.0072 1.0031 1.0305 1.0000 1.0039 1.0006 1.0229 1.0063 1.0007 0.9940
dispcorr: -0.019841189 hartree
energy: -1703.724411165909
dipole: 25.39528 -25.16827 0.22701 -15.83068 16.58200 0.75131 10.98812 -10.55526 0.43286
magnitude: 0.89631 au
magnitude: 2.27825 debye
