program: Orca
programVersion: 4.2.1
elementType: Cl Cl O N N N C C C C C C C C C C C C C C H H H H H H H H H H H H H H H H H
charge: 0
multiplicity: 1
keywords: wb97x-d3
keywords: def2-TZVPP
keywords: def2/J RIJCOSX GRIDX6 NOFINALGRIDX
keywords: grid4 nofinalgrid
keywords: scfconv7
keywords: smallprint printgap noloewdin
keywords: NOSOSCF
formula: C14H17Cl2N3O
InChI: InChI=1S/C14H17Cl2N3O/c1-2-3-6-14(20,8-19-10-17-9-18-19)12-5-4-11(15)7-13(12)16/h4-5,7,9-10,20H,2-3,6,8H2,1H3
37 atoms
Cl 0.548906 0.569482 -2.383506
Cl -3.088096 3.393417 0.259709
O  1.300886 -1.350105 1.751222
N  -0.667671 -2.503862 -0.024944
N  -1.684055 -2.106581 -0.795797
N  -2.453315 -3.027825 1.098737
C  1.183044 -0.921757 0.410562
C  2.57487 -0.525021 -0.106477
C  0.696764 -2.16419 -0.35154
C  3.137175 0.74841 0.517013
C  0.129557 0.190746 0.311363
C  4.458263 1.183452 -0.110926
C  -0.20373 0.888167 -0.851568
C  -0.612311 0.513114 1.446954
C  5.5830 0.169988 0.034085
C  -1.181369 1.871819 -0.875766
C  -1.599348 1.483855 1.454783
C  -1.142193 -3.038293 1.100311
C  -1.871297 2.166133 0.285295
C  -2.724933 -2.44665 -0.084326
H  2.567082 -0.418644 -1.189837
H  3.234737 -1.370691 0.10651
H  1.342706 -3.008051 -0.107842
H  0.745723 -2.01324 -1.425991
H  2.416968 1.563645 0.406927
H  3.28712 0.615088 1.593981
H  4.764676 2.126834 0.347477
H  4.29533 1.4000 -1.170926
H  1.694178 -0.644864 2.280106
H  -0.425642 -0.013811 2.370409
H  5.75269 -0.087136 1.081484
H  5.375634 -0.755939 -0.503513
H  6.518686 0.566142 -0.361565
H  -1.403042 2.394637 -1.795549
H  -2.141522 1.69541 2.36541
H  -0.511545 -3.437878 1.876756
H  -3.728839 -2.271643 -0.437325
elementType: Cl O N C H
totalener: -1703.70414739 hartree
nucrepener: 1900.08800443 hartree
electener: -3603.79215182 hartree
oneelecener: -6112.27059252 hartree
twoeener: 2508.47844070 hartree
cpcmener: -0.02815548 hartree
kineticenergy: 1698.99823012 hartree
xcener: -118.935056502032 hartree
chargesum: 0.0000000
charge: -0.082958 -0.087996 -0.416405 0.126715 -0.336556 -0.414847 0.485022 -0.263421 -0.128027 -0.096273 -0.118830 -0.116771 -0.064064 -0.121241 -0.282131 -0.093563 -0.183889 0.056451 0.103757 0.054520 0.092550 0.105237 0.138212 0.130233 0.083339 0.076506 0.074387 0.057920 0.228170 0.142755 0.083155 0.081609 0.093391 0.119978 0.145200 0.166856 0.161005
qa: -0.0830 -0.0880 -0.4164 0.1267 -0.3366 -0.4148 0.4850 -0.2634 -0.1280 -0.0963 -0.1188 -0.1168 -0.0641 -0.1212 -0.2821 -0.0936 -0.1839 0.0565 0.1038 0.0545 0.0926 0.1052 0.1382 0.1302 0.0833 0.0765 0.0744 0.0579 0.2282 0.1428 0.0832 0.0816 0.0934 0.1200 0.1452 0.1669 0.1610
va: 1.2417 1.2163 2.0185 3.3647 2.8847 3.0269 3.6652 3.9121 3.8128 3.8149 3.5194 3.9101 3.9659 3.8682 3.9265 4.0265 4.0614 4.0739 3.8588 4.0463 1.0251 1.0205 1.0152 1.0222 1.0169 1.0133 1.0061 1.0083 1.0113 1.0303 1.0006 0.9983 1.0042 1.0230 1.0059 1.0103 0.9962
dispcorr: -0.021650123 hartree
energy: -1703.725797516206
dipole: 35.14941 -32.75395 2.39546 -9.22352 9.56974 0.34622 7.96619 -7.37946 0.58673
magnitude: 2.49045 au
magnitude: 6.33023 debye
