program: Orca
programVersion: 4.2.1
elementType: Cl Cl O N N N C C C C C C C C C C C C C C H H H H H H H H H H H H H H H H H
charge: 0
multiplicity: 1
keywords: wb97x-d3
keywords: def2-TZVPP
keywords: def2/J RIJCOSX GRIDX6 NOFINALGRIDX
keywords: grid4 nofinalgrid
keywords: scfconv7
keywords: smallprint printgap noloewdin
keywords: NOSOSCF
formula: C14H17Cl2N3O
InChI: InChI=1S/C14H17Cl2N3O/c1-2-3-6-14(20,8-19-10-17-9-18-19)12-5-4-11(15)7-13(12)16/h4-5,7,9-10,20H,2-3,6,8H2,1H3
37 atoms
Cl 0.064869 0.141617 -2.628224
Cl -2.446653 3.676487 0.43924
O  1.542468 -1.545167 1.407844
N  -0.826253 -2.569298 -0.060039
N  -1.016785 -2.799467 1.242091
N  -2.979526 -2.61966 0.192593
C  1.205264 -1.168859 0.093641
C  2.527885 -0.89815 -0.643938
C  0.502418 -2.36747 -0.584013
C  3.218896 0.432097 -0.359858
C  0.283575 0.060644 0.116798
C  3.741399 0.644079 1.055934
C  -0.263219 0.682208 -1.008165
C  -0.052299 0.628708 1.345395
C  4.485846 1.964802 1.187308
C  -1.099766 1.785824 -0.92047
C  -0.88106 1.730524 1.467625
C  -2.004762 -2.453743 -0.67141
C  -1.40533 2.302736 0.324316
C  -2.323003 -2.822732 1.347983
H  2.354402 -0.961788 -1.718363
H  3.202381 -1.725023 -0.402261
H  1.097102 -3.265372 -0.407914
H  0.413598 -2.245212 -1.658749
H  4.065065 0.50191 -1.050707
H  2.555891 1.260161 -0.62998
H  4.406348 -0.18242 1.325924
H  2.921977 0.623058 1.776386
H  0.778032 -1.983679 1.814883
H  0.355009 0.20475 2.250896
H  3.824962 2.812203 0.990283
H  4.896134 2.097708 2.189449
H  5.31756 2.029354 0.481824
H  -1.503628 2.23395 -1.817739
H  -1.108914 2.12996 2.446182
H  -2.103379 -2.259393 -1.728154
H  -2.816901 -2.995513 2.291403
elementType: Cl O N C H
totalener: -1703.71518167 hartree
nucrepener: 1913.45581740 hartree
electener: -3617.17099907 hartree
oneelecener: -6138.73973147 hartree
twoeener: 2521.56873240 hartree
cpcmener: -0.01996273 hartree
kineticenergy: 1698.95857752 hartree
xcener: -118.930540919117 hartree
chargesum: 0.0000000
charge: -0.078948 -0.084207 -0.418829 0.149613 -0.384282 -0.404463 0.477154 -0.204971 -0.204520 -0.104442 0.020377 -0.083955 -0.179352 -0.196223 -0.284075 -0.050816 -0.147541 0.080703 0.072205 0.084682 0.099767 0.094580 0.141019 0.133066 0.084322 0.068019 0.060557 0.055841 0.218304 0.142881 0.079427 0.091379 0.077314 0.120072 0.144150 0.166876 0.164317
qa: -0.0789 -0.0842 -0.4188 0.1496 -0.3843 -0.4045 0.4772 -0.2050 -0.2045 -0.1044 0.0204 -0.0840 -0.1794 -0.1962 -0.2841 -0.0508 -0.1475 0.0807 0.0722 0.0847 0.0998 0.0946 0.1410 0.1331 0.0843 0.0680 0.0606 0.0558 0.2183 0.1429 0.0794 0.0914 0.0773 0.1201 0.1441 0.1669 0.1643
va: 1.2488 1.2205 2.0080 3.2990 2.8611 3.0343 3.5784 3.8610 3.9221 3.8675 3.3988 3.8502 4.0256 3.9198 3.9450 3.9758 4.0326 4.0354 3.9016 4.0154 1.0179 1.0303 1.0095 1.0105 1.0075 1.0055 1.0109 1.0207 1.0593 1.0307 1.0007 1.0037 1.0019 1.0209 1.0048 1.0006 0.9927
dispcorr: -0.022067896 hartree
energy: -1703.737249570427
dipole: 30.20878 -29.34268 0.86611 -6.94827 6.57394 -0.37433 8.59471 -9.27527 -0.68056
magnitude: 1.16337 au
magnitude: 2.95705 debye
