program: Orca
programVersion: 4.2.1
elementType: Cl Cl O N N N C C C C C C C C C C C C C C H H H H H H H H H H H H H H H H H
charge: 0
multiplicity: 1
keywords: wb97x-d3
keywords: def2-TZVPP
keywords: def2/J RIJCOSX GRIDX6 NOFINALGRIDX
keywords: grid4 nofinalgrid
keywords: scfconv7
keywords: smallprint printgap noloewdin
keywords: NOSOSCF
formula: C14H17Cl2N3O
InChI: InChI=1S/C14H17Cl2N3O/c1-2-3-6-14(20,8-19-10-17-9-18-19)12-5-4-11(15)7-13(12)16/h4-5,7,9-10,20H,2-3,6,8H2,1H3
37 atoms
Cl 0.513074 0.418683 -2.414591
Cl -2.78349 3.548007 0.332886
O  1.224808 -1.55744 1.692971
N  -0.852136 -2.551267 -0.037152
N  -1.854695 -2.065104 -0.77225
N  -2.649138 -3.09192 1.050823
C  1.119136 -1.105869 0.360689
C  2.526459 -0.812651 -0.185709
C  0.520794 -2.298989 -0.400149
C  3.172675 0.456926 0.357274
C  0.161341 0.092171 0.295168
C  4.594974 0.638354 -0.158426
C  -0.160897 0.80475 -0.86137
C  -0.495725 0.490942 1.457896
C  5.2523 1.908622 0.357548
C  -1.056301 1.863636 -0.858543
C  -1.397546 1.540936 1.493909
C  -1.338604 -3.152515 1.051183
C  -1.668337 2.227213 0.32656
C  -2.910499 -2.415174 -0.084896
H  2.513986 -0.765859 -1.273606
H  3.147814 -1.677238 0.069013
H  1.114667 -3.188568 -0.187435
H  0.545935 -2.137209 -1.474053
H  2.57548 1.329306 0.076314
H  3.196648 0.448134 1.453632
H  4.580089 0.653527 -1.25253
H  5.199019 -0.228777 0.125026
H  1.777668 -0.951266 2.198746
H  -0.314502 -0.04195 2.379277
H  5.32381 1.906819 1.447212
H  6.26352 2.022458 -0.03627
H  4.685939 2.795929 0.067174
H  -1.275713 2.391735 -1.776047
H  -1.878797 1.807444 2.424699
H  -0.715063 -3.619505 1.796864
H  -3.909611 -2.178283 -0.417487
elementType: Cl O N C H
totalener: -1703.71447269 hartree
nucrepener: 1891.95487079 hartree
electener: -3595.66934348 hartree
oneelecener: -6096.06982630 hartree
twoeener: 2500.40048282 hartree
cpcmener: -0.02370001 hartree
kineticenergy: 1698.96599042 hartree
xcener: -118.927307311166 hartree
chargesum: 0.0000000
charge: -0.082191 -0.086571 -0.393731 0.128972 -0.333815 -0.410507 0.464619 -0.251046 -0.146208 -0.079546 -0.072063 -0.085780 -0.085200 -0.133722 -0.283427 -0.086840 -0.180711 0.058490 0.097981 0.057628 0.087400 0.105544 0.134852 0.131848 0.067004 0.060602 0.061440 0.060406 0.215663 0.142026 0.079235 0.091605 0.079507 0.118815 0.142372 0.166762 0.158587
qa: -0.0822 -0.0866 -0.3937 0.1290 -0.3338 -0.4105 0.4646 -0.2510 -0.1462 -0.0795 -0.0721 -0.0858 -0.0852 -0.1337 -0.2834 -0.0868 -0.1807 0.0585 0.0980 0.0576 0.0874 0.1055 0.1349 0.1318 0.0670 0.0606 0.0614 0.0604 0.2157 0.1420 0.0792 0.0916 0.0795 0.1188 0.1424 0.1668 0.1586
va: 1.2432 1.2177 2.0381 3.3561 2.8800 3.0318 3.6836 3.8948 3.8225 3.8130 3.4664 3.8887 3.9681 3.8953 3.9497 4.0215 4.0704 4.0687 3.8717 4.0448 1.0256 1.0214 1.0165 1.0228 1.0157 1.0179 1.0059 1.0082 1.0246 1.0318 1.0002 1.0041 1.0005 1.0225 1.0067 1.0076 0.9964
dispcorr: -0.021145762 hartree
energy: -1703.735618450278
dipole: 33.95970 -31.51742 2.44229 -7.12196 7.22842 0.10645 8.08594 -7.61991 0.46603
magnitude: 2.48863 au
magnitude: 6.32559 debye
