program: Orca
programVersion: 4.2.1
elementType: Cl Cl O N N N C C C C C C C C C C C C C C H H H H H H H H H H H H H H H H H
charge: 0
multiplicity: 1
keywords: wb97x-d3
keywords: def2-TZVPP
keywords: def2/J RIJCOSX GRIDX6 NOFINALGRIDX
keywords: grid4 nofinalgrid
keywords: scfconv7
keywords: smallprint printgap noloewdin
keywords: NOSOSCF
formula: C14H17Cl2N3O
InChI: InChI=1S/C14H17Cl2N3O/c1-2-3-6-14(20,8-19-10-17-9-18-19)12-5-4-11(15)7-13(12)16/h4-5,7,9-10,20H,2-3,6,8H2,1H3
37 atoms
Cl -0.332911 0.559498 -2.339948
Cl -1.610989 5.057064 0.172696
O  0.051938 -1.02856 1.964651
N  -0.813082 -3.077195 0.015391
N  -0.484696 -3.691016 1.156263
N  -0.370001 -5.123419 -0.553083
C  -0.029409 -0.789049 0.577891
C  1.340501 -1.086977 -0.060371
C  -1.153807 -1.672288 -0.009091
C  2.441622 -0.121272 0.359976
C  -0.440451 0.675758 0.416344
C  3.81044 -0.55672 -0.149033
C  -0.590127 1.337679 -0.805486
C  -0.679875 1.442328 1.557453
C  4.926512 0.377339 0.291935
C  -0.951045 2.675014 -0.889083
C  -1.037097 2.778553 1.50531
C  -0.735699 -3.942365 -0.995194
C  -1.170113 3.389424 0.273193
C  -0.224812 -4.914965 0.766862
H  1.269322 -1.112648 -1.147964
H  1.631972 -2.098816 0.239854
H  -1.372721 -1.424044 -1.043773
H  -2.067357 -1.519155 0.567967
H  2.226264 0.884368 -0.014161
H  2.468208 -0.044789 1.450762
H  3.791424 -0.613328 -1.241874
H  4.024252 -1.57049 0.203515
H  0.118054 -1.986921 2.099036
H  -0.580705 0.986792 2.530244
H  5.002363 0.419362 1.380464
H  5.894908 0.051203 -0.090832
H  4.760041 1.39597 -0.064475
H  -1.054945 3.148478 -1.855298
H  -1.205278 3.327754 2.42122
H  -0.955959 -3.674422 -2.016718
H  0.07695 -5.682523 1.462303
elementType: Cl O N C H
totalener: -1703.71715072 hartree
nucrepener: 1844.77064561 hartree
electener: -3548.48779634 hartree
oneelecener: -6001.17503329 hartree
twoeener: 2452.68723696 hartree
cpcmener: -0.01915762 hartree
kineticenergy: 1698.95189804 hartree
xcener: -118.928727503389 hartree
chargesum: -0.0000000
charge: -0.086233 -0.084534 -0.430055 0.117467 -0.385277 -0.408084 0.458307 -0.265510 -0.163127 -0.088991 0.026925 -0.083996 -0.058083 -0.166455 -0.286551 -0.111451 -0.172069 0.089734 0.098342 0.088169 0.088590 0.089491 0.124777 0.141990 0.062870 0.068816 0.058008 0.059944 0.217978 0.150506 0.079607 0.090517 0.078618 0.122245 0.143102 0.170165 0.164248
qa: -0.0862 -0.0845 -0.4301 0.1175 -0.3853 -0.4081 0.4583 -0.2655 -0.1631 -0.0890 0.0269 -0.0840 -0.0581 -0.1665 -0.2866 -0.1115 -0.1721 0.0897 0.0983 0.0882 0.0886 0.0895 0.1248 0.1420 0.0629 0.0688 0.0580 0.0599 0.2180 0.1505 0.0796 0.0905 0.0786 0.1222 0.1431 0.1702 0.1642
va: 1.2343 1.2202 1.9924 3.3267 2.8559 3.0297 3.6556 3.8949 3.8796 3.8304 3.3608 3.8797 3.9890 3.9876 3.9483 4.0416 4.0386 4.0368 3.8753 4.0126 1.0299 1.0197 1.0233 1.0071 1.0122 1.0319 1.0051 1.0071 1.0639 1.0332 1.0003 1.0041 1.0007 1.0225 1.0073 0.9937 0.9928
dispcorr: -0.019793125 hartree
energy: -1703.736943847596
dipole: 25.18809 -25.38914 -0.20105 -16.61281 16.82168 0.20887 7.42259 -7.78912 -0.36654
magnitude: 0.46733 au
magnitude: 1.18786 debye
