program: Orca
programVersion: 4.2.1
elementType: Cl Cl O N N N C C C C C C C C C C C C C C H H H H H H H H H H H H H H H H H
charge: 0
multiplicity: 1
keywords: wb97x-d3
keywords: def2-TZVPP
keywords: def2/J RIJCOSX GRIDX6 NOFINALGRIDX
keywords: grid4 nofinalgrid
keywords: scfconv7
keywords: smallprint printgap noloewdin
keywords: NOSOSCF
formula: C14H17Cl2N3O
InChI: InChI=1S/C14H17Cl2N3O/c1-2-3-6-14(20,8-19-10-17-9-18-19)12-5-4-11(15)7-13(12)16/h4-5,7,9-10,20H,2-3,6,8H2,1H3
37 atoms
Cl -0.354811 0.625586 -2.350889
Cl -1.945106 5.038397 0.132898
O  0.160062 -0.887121 1.966119
N  -0.598584 -3.007203 0.054799
N  -0.215093 -3.574692 1.20358
N  -0.000973 -5.027914 -0.481864
C  0.05624 -0.671642 0.581383
C  1.433635 -0.901907 -0.069686
C  -1.019674 -1.625479 0.012002
C  2.479047 0.13129 0.332453
C  -0.448168 0.761958 0.404221
C  3.87227 -0.182644 -0.207968
C  -0.654615 1.398622 -0.821402
C  -0.73213 1.519121 1.540991
C  4.489033 -1.455652 0.357016
C  -1.114041 2.704849 -0.912326
C  -1.187054 2.823903 1.478867
C  -0.457512 -3.888423 -0.940766
C  -1.377377 3.414283 0.243616
C  0.137161 -4.784469 0.833066
H  1.355059 -0.935213 -1.157227
H  1.770874 -1.896543 0.234988
H  -1.252891 -1.39902 -1.025338
H  -1.934553 -1.512672 0.596784
H  2.177054 1.117811 -0.029066
H  2.519827 0.203907 1.422605
H  4.528698 0.66069 0.020803
H  3.835447 -0.244252 -1.300041
H  0.234074 -1.842359 2.115112
H  -0.585778 1.069891 2.510516
H  4.508861 -1.431694 1.448122
H  3.940783 -2.349825 0.058729
H  5.515734 -1.581803 0.012959
H  -1.261144 3.159509 -1.881455
H  -1.389493 3.373215 2.387428
H  -0.701471 -3.66154 -1.967227
H  0.500987 -5.513215 1.540072
totalener: -1703.69309611 hartree
nucrepener: 1853.46145321 hartree
electener: -3557.15454932 hartree
oneelecener: -6018.55939876 hartree
twoeener: 2461.40484944 hartree
kineticenergy: 1698.96046794 hartree
xcener: -118.930174283440 hartree
chargesum: -0.0000000
charge: -0.084383 -0.067817 -0.387652 0.108377 -0.352570 -0.326574 0.486428 -0.290254 -0.186637 -0.085476 -0.023023 -0.115056 -0.051487 -0.127740 -0.261766 -0.116035 -0.147929 0.063670 0.092629 0.081601 0.082543 0.089856 0.110146 0.135941 0.074707 0.080604 0.070549 0.053786 0.195896 0.140953 0.079719 0.072619 0.088035 0.113563 0.124806 0.141347 0.136624
qa: -0.0844 -0.0678 -0.3877 0.1084 -0.3526 -0.3266 0.4864 -0.2903 -0.1866 -0.0855 -0.0230 -0.1151 -0.0515 -0.1277 -0.2618 -0.1160 -0.1479 0.0637 0.0926 0.0816 0.0825 0.0899 0.1101 0.1359 0.0747 0.0806 0.0705 0.0538 0.1959 0.1410 0.0797 0.0726 0.0880 0.1136 0.1248 0.1413 0.1366
va: 1.2388 1.2381 2.0410 3.3224 2.8598 3.0606 3.6117 3.9386 3.8934 3.8302 3.4606 3.9090 3.9742 3.9918 3.9313 4.0512 4.0283 4.0597 3.9389 4.0258 1.0314 1.0158 1.0306 1.0062 1.0160 1.0306 1.0065 1.0069 1.0920 1.0386 1.0027 1.0019 1.0062 1.0243 1.0133 1.0011 1.0001
dispcorr: -0.020245474 hartree
energy: -1703.713341583845
dipole: 25.40557 -25.51851 -0.11295 -19.75782 19.92256 0.16475 7.57405 -7.74477 -0.17072
magnitude: 0.26276 au
magnitude: 0.66789 debye
